{"text_format":"1","workbook":"xlsx","n_sheets":8,"sheets":["Orçamento","Resumo ","Somatório","Cronog_60_Dias","Composição BDI","Relatório CENTRAL","Parc Maior Relev","Composições"],"not_rendered":{"charts":0,"images":5,"macros":1,"external_links":1,"defined_names":124,"comments":2,"pivot_tables":0},"unopened":[],"bounds":{"document_bytes":16777216,"sheet_cells":100000,"rows_first":2000,"rows_last":500,"rows_between":2000,"halvings":0,"cell_chars":16384,"cell_head_chars":4096},"cells_cut":0,"cells_raw":0,"read":"whole","date_system":"1900"}

{"sheet":"Orçamento","index":0,"n_rows":395,"n_cols":24,"rows_kept":395,"cut":false,"hidden":false,"merged":[[376,18,376,20],[376,21,376,22],[377,15,377,17],[377,18,377,20],[377,21,377,22],[378,15,378,17],[378,18,378,20],[378,21,378,22],[373,15,373,17],[373,18,373,20],[373,21,373,22],[374,15,374,17],[374,18,374,20],[374,21,374,22],[375,15,375,17],[375,18,375,20],[375,21,375,22],[387,18,387,20],[387,21,387,22],[382,15,382,17],[382,18,382,20],[382,21,382,22],[383,15,383,17],[383,18,383,20],[383,21,383,22],[384,15,384,17],[384,18,384,20],[384,21,384,22],[363,14,363,17],[370,15,370,17],[336,15,336,17],[391,18,391,20],[391,21,391,22],[379,15,379,17],[379,18,379,20],[379,21,379,22],[380,15,380,17],[380,18,380,20],[380,21,380,22],[381,15,381,17],[381,18,381,20],[381,21,381,22],[385,15,385,17],[385,18,385,20],[385,21,385,22],[386,15,386,17],[386,18,386,20],[386,21,386,22],[387,15,387,17],[376,15,376,17],[331,16,331,22],[394,18,394,20],[394,21,394,22],[391,14,391,17],[388,15,388,17],[388,18,388,20],[388,21,388,22],[389,15,389,17],[389,18,389,20],[389,21,389,22],[390,15,390,17],[390,18,390,20],[390,21,390,22],[393,18,393,20],[393,21,393,22],[392,18,392,20],[392,21,392,22],[369,14,369,23],[370,18,370,20],[370,21,370,22],[371,15,371,17],[371,18,371,20],[371,21,371,22],[372,15,372,17],[372,18,372,20],[372,21,372,22],[327,16,327,22],[328,16,328,22],[329,16,329,22],[3,21,3,22],[2,21,2,22],[5,21,5,22],[10,14,10,23],[13,14,13,23],[6,21,6,22],[2,14,2,20],[3,14,3,20],[5,18,5,20],[6,18,6,20],[6,14,6,17],[5,14,5,17],[12,21,12,22],[12,18,12,20],[8,18,8,20],[8,21,8,22],[9,19,9,20],[349,15,349,17],[350,15,350,17],[351,15,351,17],[352,15,352,17],[353,15,353,17],[354,15,354,17],[355,15,355,17],[356,15,356,17],[357,15,357,17],[337,15,337,17],[338,15,338,17],[339,15,339,17],[340,15,340,17],[341,15,341,17],[342,15,342,17],[343,15,343,17],[344,15,344,17],[345,15,345,17],[358,15,358,17],[359,15,359,17],[360,15,360,17],[361,15,361,17],[362,15,362,17],[335,14,335,23],[324,20,324,21],[323,20,323,21],[319,17,324,17],[319,20,319,21],[336,18,336,20],[336,21,336,22],[337,18,337,20],[337,21,337,22],[325,20,325,21],[345,18,345,20],[345,21,345,22],[346,18,346,20],[346,21,346,22],[347,18,347,20],[347,21,347,22],[348,18,348,20],[348,21,348,22],[360,18,360,20],[363,18,363,20],[363,21,363,22],[360,21,360,22],[361,18,361,20],[361,21,361,22],[362,18,362,20],[362,21,362,22],[352,18,352,20],[352,21,352,22],[359,18,359,20],[359,21,359,22],[354,21,354,22],[355,18,355,20],[355,21,355,22],[357,18,357,20],[353,18,353,20],[353,21,353,22],[354,18,354,20],[364,18,364,20],[364,21,364,22],[351,18,351,20],[351,21,351,22],[344,18,344,20],[344,21,344,22],[366,18,366,20],[366,21,366,22],[320,20,320,21],[342,18,342,20],[342,21,342,22],[343,18,343,20],[343,21,343,22],[341,18,341,20],[341,21,341,22],[350,18,350,20],[321,20,321,21],[332,18,332,22],[338,18,338,20],[338,21,338,22],[339,18,339,20],[339,21,339,22],[340,18,340,20],[340,21,340,22],[330,16,330,22],[8,12,9,12],[365,18,365,20],[365,21,365,22],[0,14,0,22],[8,14,8,16],[9,14,9,16],[11,14,11,16],[12,14,12,16],[14,14,14,22],[1,14,1,22],[4,14,4,22],[7,14,7,22],[349,18,349,20],[349,21,349,22],[357,21,357,22],[346,15,346,17],[347,15,347,17],[348,15,348,17],[350,21,350,22],[358,18,358,20],[358,21,358,22],[356,18,356,20],[356,21,356,22]]}
[]
[]
[null,null,null,null,null,null,null,null,null,null,null,null,null,null,"UNIDADE ESCOLAR",null,null,null,null,null,null,"CÓDIGO INEP"]
[null,null,null,null,null,null,null,null,null,null,null,null,null,null,"CENTRO DE ATENDIMENTO EDUCACIONAL ESPECIALIZADO DE IPORÁ",null,null,null,null,null,null,52070069]
[]
["Nmax",null,null,null,null,null,null,null,null,null,null,null,"Ajustar altura?",null,"OBRA",null,null,null,"DATA",null,null,"CIDADE"]
[{"$f":"MAX($C$18:$C$319)","v":4},null,null,null,null,null,null,null,null,null,null,null,"NÃO",null,"REFORMA",null,null,null,"2020-04-06",null,null,"IPORÁ"]
[null,null,null,null,null,null,null,"DESONERADA"]
[null,null,null,null,null,null,null,null,null,null,null,null,"",null,"CRE",null,null,"ENDEREÇO","REFERÊNCIA AGETOP",null,null,"REFERÊNCIA SINAPI"]
[null,null,null,null,null,null,null,null,null,null,null,null,null,null,"IPORÁ",null,null,"AV DR NETO ESQ. C/ RUA GOIÂNIA S/N, CENTRO, CEP:76200-000","ABR/19","DESONERADA",null,"DEZ/19","DESONERADA"]
[]
[null,null,null,null,null,null,null,null,null,null,null,null,null,null,"ÁREA EXISTENTE (M²)",null,null,"ÁREA A CONSTRUIR (M²)","ÁREA A DEMOLIR (M²)",null,null,"ÁREA TOTAL CONSTRUÍDA (M²)"]
[null,null,null,null,null,null,null,null,null,null,null,null,null,null,592.29999999999995,null,null,50.8,0,null,null,643.09999999999991]
[]
[null,null,null,null,null,null,null,null,null,null,null,"FILTRO",null,null,"PLANILHA ORÇAMENTÁRIA"]
["Nível E","Save Nivel","Nível C","Altura","n1","n2","n3","n4","n5","Czero","Cnível","↓","Nível","Nível Corrigido","ITEM","TABELA","CODIGO","DESCRIÇÃO DOS SERVIÇOS","UNID","QUANT","MAT","MO","T.SERVIÇO","OBSERVAÇÕES¹"]
[{"$f":"CHOOSE(1+LOG(1+2*(ORÇAMENTO.Nivel=\"Nível 1\")+4*(ORÇAMENTO.Nivel=\"Nível 2\")+8*(ORÇAMENTO.Nivel=\"Nível 3\")+16*(ORÇAMENTO.Nivel=\"Nível 4\")+32*(ORÇAMENTO.Nivel=\"Serviço\"),2),0,1,2,3,4,\"S\")","v":"S"},{"$f":"IF(OR(C17=\"s\",C17=0),OFFSET(B17,-1,0),C17)","v":"Save Nivel"},{"$f":"IF(OFFSET(C17,-1,0)=\"L\",1,IF(OFFSET(C17,-1,0)=1,2,IF(OR(A17=\"s\",A17=0),\"S\",IF(AND(OFFSET(C17,-1,0)=2,A17=4),3,IF(AND(OR(OFFSET(C17,-1,0)=\"s\",OFFSET(C17,-1,0)=0),A17<>\"s\",A17>OFFSET(B17,-1,0)),OFFSET(B17,-1,0),A17)))))","v":"S"},{"$f":"IF(OR(C17=\"S\",C17=0),0,IF(ISERROR(K17),J17,SMALL(J17:K17,1)))","v":0},{"$f":"IF($C17=1,OFFSET(E17,-1,0)+1,OFFSET(E17,-1,0))","v":"n1"},{"$f":"IF($C17=1,0,IF($C17=2,OFFSET(F17,-1,0)+1,OFFSET(F17,-1,0)))","v":"n2"},{"$f":"IF(AND($C17<=2,$C17<>0),0,IF($C17=3,OFFSET(G17,-1,0)+1,OFFSET(G17,-1,0)))","v":"n3"},{"$f":"IF(AND($C17<=3,$C17<>0),0,IF($C17=4,OFFSET(H17,-1,0)+1,OFFSET(H17,-1,0)))","v":"n4"},{"$f":"IF(AND($C17<=4,$C17<>0),0,IF(AND($C17=\"S\",$W17>0),OFFSET(I17,-1,0)+1,OFFSET(I17,-1,0)))","v":"n5"},{"$f":"IF(OR($C17=\"S\",$C17=0),0,MATCH(0,OFFSET($D17,1,$C17,ROW($C$319)-ROW($C17)),0))","v":0},{"$f":"IF(OR($C17=\"S\",$C17=0),0,MATCH(OFFSET($D17,0,$C17)+1,OFFSET($D17,1,$C17,ROW($C$319)-ROW($C17)),0))","v":0},"","Serviço","Serviço","-","SINAPI",null,"(sem código)","-",null,0,0,0,""]
[0,null,"L",{"$f":"COUNTA(OFFSET(D18,1,0):D$319)","v":300},{"$f":"LEFT(O19,1)-1","v":0},null,null,null,null,null,null,"F","LOTE","LOTE","REFORMA - CENTRO DE ATENDIMENTO EDUCACIONAL ESPECIALIZADO DE IPORÁ",null,null,null,null,null,null,null,0]
[{"$f":"CHOOSE(1+LOG(1+2*(ORÇAMENTO.Nivel=\"Nível 1\")+4*(ORÇAMENTO.Nivel=\"Nível 2\")+8*(ORÇAMENTO.Nivel=\"Nível 3\")+16*(ORÇAMENTO.Nivel=\"Nível 4\")+32*(ORÇAMENTO.Nivel=\"Serviço\"),2),0,1,2,3,4,\"S\")","v":1},{"$f":"IF(OR(C19=\"s\",C19=0),OFFSET(B19,-1,0),C19)","v":1},{"$f":"IF(OFFSET(C19,-1,0)=\"L\",1,IF(OFFSET(C19,-1,0)=1,2,IF(OR(A19=\"s\",A19=0),\"S\",IF(AND(OFFSET(C19,-1,0)=2,A19=4),3,IF(AND(OR(OFFSET(C19,-1,0)=\"s\",OFFSET(C19,-1,0)=0),A19<>\"s\",A19>OFFSET(B19,-1,0)),OFFSET(B19,-1,0),A19)))))","v":1},{"$f":"IF(OR(C19=\"S\",C19=0),0,IF(ISERROR(K19),J19,SMALL(J19:K19,1)))","v":300},{"$f":"IF($C19=1,OFFSET(E19,-1,0)+1,OFFSET(E19,-1,0))","v":1},{"$f":"IF($C19=1,0,IF($C19=2,OFFSET(F19,-1,0)+1,OFFSET(F19,-1,0)))","v":0},{"$f":"IF(AND($C19<=2,$C19<>0),0,IF($C19=3,OFFSET(G19,-1,0)+1,OFFSET(G19,-1,0)))","v":0},{"$f":"IF(AND($C19<=3,$C19<>0),0,IF($C19=4,OFFSET(H19,-1,0)+1,OFFSET(H19,-1,0)))","v":0},{"$f":"IF(AND($C19<=4,$C19<>0),0,IF(AND($C19=\"S\",$W19>0),OFFSET(I19,-1,0)+1,OFFSET(I19,-1,0)))","v":0},{"$f":"IF(OR($C19=\"S\",$C19=0),0,MATCH(0,OFFSET($D19,1,$C19,ROW($C$319)-ROW($C19)),0))","v":300},{"$f":"IF(OR($C19=\"S\",$C19=0),0,MATCH(OFFSET($D19,0,$C19)+1,OFFSET($D19,1,$C19,ROW($C$319)-ROW($C19)),0))","v":{"$error":"#N/A"}},"F","Nível 1","Nível 1","1.","AGETOP",null,"REFORMA",null,null,null,null,0]
[2,{"$f":"IF(OR(C20=\"s\",C20=0),OFFSET(B20,-1,0),C20)","v":2},{"$f":"IF(OFFSET(C20,-1,0)=\"L\",1,IF(OFFSET(C20,-1,0)=1,2,IF(OR(A20=\"s\",A20=0),\"S\",IF(AND(OFFSET(C20,-1,0)=2,A20=4),3,IF(AND(OR(OFFSET(C20,-1,0)=\"s\",OFFSET(C20,-1,0)=0),A20<>\"s\",A20>OFFSET(B20,-1,0)),OFFSET(B20,-1,0),A20)))))","v":2},{"$f":"IF(OR(C20=\"S\",C20=0),0,IF(ISERROR(K20),J20,SMALL(J20:K20,1)))","v":21},{"$f":"IF($C20=1,OFFSET(E20,-1,0)+1,OFFSET(E20,-1,0))","v":1},{"$f":"IF($C20=1,0,IF($C20=2,OFFSET(F20,-1,0)+1,OFFSET(F20,-1,0)))","v":1},{"$f":"IF(AND($C20<=2,$C20<>0),0,IF($C20=3,OFFSET(G20,-1,0)+1,OFFSET(G20,-1,0)))","v":0},{"$f":"IF(AND($C20<=3,$C20<>0),0,IF($C20=4,OFFSET(H20,-1,0)+1,OFFSET(H20,-1,0)))","v":0},{"$f":"IF(AND($C20<=4,$C20<>0),0,IF(AND($C20=\"S\",$W20>0),OFFSET(I20,-1,0)+1,OFFSET(I20,-1,0)))","v":0},299,21,"","Nível 2","Nível 2","-","AGETOP",null,"SERVIÇOS PRELIMINARES",null,null,null,null,0]
[3,{"$f":"IF(OR(C21=\"s\",C21=0),OFFSET(B21,-1,0),C21)","v":3},{"$f":"IF(OFFSET(C21,-1,0)=\"L\",1,IF(OFFSET(C21,-1,0)=1,2,IF(OR(A21=\"s\",A21=0),\"S\",IF(AND(OFFSET(C21,-1,0)=2,A21=4),3,IF(AND(OR(OFFSET(C21,-1,0)=\"s\",OFFSET(C21,-1,0)=0),A21<>\"s\",A21>OFFSET(B21,-1,0)),OFFSET(B21,-1,0),A21)))))","v":3},{"$f":"IF(OR(C21=\"S\",C21=0),0,IF(ISERROR(K21),J21,SMALL(J21:K21,1)))","v":4},{"$f":"IF($C21=1,OFFSET(E21,-1,0)+1,OFFSET(E21,-1,0))","v":1},{"$f":"IF($C21=1,0,IF($C21=2,OFFSET(F21,-1,0)+1,OFFSET(F21,-1,0)))","v":1},{"$f":"IF(AND($C21<=2,$C21<>0),0,IF($C21=3,OFFSET(G21,-1,0)+1,OFFSET(G21,-1,0)))","v":1},{"$f":"IF(AND($C21<=3,$C21<>0),0,IF($C21=4,OFFSET(H21,-1,0)+1,OFFSET(H21,-1,0)))","v":0},{"$f":"IF(AND($C21<=4,$C21<>0),0,IF(AND($C21=\"S\",$W21>0),OFFSET(I21,-1,0)+1,OFFSET(I21,-1,0)))","v":0},20,4,"","Nível 3","Nível 3","-","SINAPI",null,"ADEQUAÇÕES DE ACESSIBILIDADE","-",null,0,0,0,""]
["S",3,"S",0,1,1,1,0,0,0,0,"","Serviço","Serviço","-","AGETOP",67010,"ESCARIFICAÇÃO MANUAL, CORTE DE CONCRETO ATÉ 3CM DE PROFUNDIDADE","m3    ",0.04,null,null,0,""]
["S",3,"S",0,1,1,1,0,0,0,0,"","Serviço","Serviço","-","AGETOP",20126,"DEMOLICAO - PISO INTERTRAVADO C/ EMPILHAMENTO","m2    ",23.58,null,null,0,""]
["S",3,"S",0,1,1,1,0,0,0,0,"","Serviço","Serviço","-","SINAPI",97644,"REMOÇÃO DE PORTAS, DE FORMA MANUAL, SEM REAPROVEITAMENTO. AF_12/2017","M2",3.78,null,null,0,"Referência: AGETOP - 20106"]
[3,3,3,5,1,1,2,0,0,16,5,"","Nível 3","Nível 3","-","AGETOP",null,"AMPLIAÇÃO DA ÁREA DE SERVIÇOS","-",null,null,null,0,""]
["S",3,"S",0,1,1,2,0,0,0,0,"","Serviço","Serviço","-","AGETOP",20121,"DEM. MANUAL EM CONCR.SIMPLES C/TR.ATE CB.E CARGA (O.C.)","m3    ",2.23,null,null,0,""]
["S",{"$f":"IF(OR(C27=\"s\",C27=0),OFFSET(B27,-1,0),C27)","v":3},{"$f":"IF(OFFSET(C27,-1,0)=\"L\",1,IF(OFFSET(C27,-1,0)=1,2,IF(OR(A27=\"s\",A27=0),\"S\",IF(AND(OFFSET(C27,-1,0)=2,A27=4),3,IF(AND(OR(OFFSET(C27,-1,0)=\"s\",OFFSET(C27,-1,0)=0),A27<>\"s\",A27>OFFSET(B27,-1,0)),OFFSET(B27,-1,0),A27)))))","v":"S"},{"$f":"IF(OR(C27=\"S\",C27=0),0,IF(ISERROR(K27),J27,SMALL(J27:K27,1)))","v":0},{"$f":"IF($C27=1,OFFSET(E27,-1,0)+1,OFFSET(E27,-1,0))","v":1},{"$f":"IF($C27=1,0,IF($C27=2,OFFSET(F27,-1,0)+1,OFFSET(F27,-1,0)))","v":1},{"$f":"IF(AND($C27<=2,$C27<>0),0,IF($C27=3,OFFSET(G27,-1,0)+1,OFFSET(G27,-1,0)))","v":2},{"$f":"IF(AND($C27<=3,$C27<>0),0,IF($C27=4,OFFSET(H27,-1,0)+1,OFFSET(H27,-1,0)))","v":0},{"$f":"IF(AND($C27<=4,$C27<>0),0,IF(AND($C27=\"S\",$W27>0),OFFSET(I27,-1,0)+1,OFFSET(I27,-1,0)))","v":0},0,0,"","Serviço","Serviço","-","AGETOP",20118,"DEM.ALVEN.TIJOLO S/REAP. C/TR.ATE CB. E CARGA","m3    ",0.64,null,null,0,""]
["S",3,"S",0,1,1,2,0,0,0,0,"","Serviço","Serviço","-","AGETOP",20115,"DEMOLIÇÃO DE REVESTIMENTOS COM AZULEJOS C/TRANSP.ATE CB. E CARGA","m2    ",3.98,null,null,0,""]
["S",3,"S",0,1,1,2,0,0,0,0,"","Serviço","Serviço","-","AGETOP",20163,"DEMOLIÇÃO DAS INSTALAÇÕES HIDROSANITÁRIAS E AFINS C/ TRANSP. ATÉ CB. E CARGA","H     ",0.1,null,null,0,""]
[3,3,3,3,1,1,3,0,0,11,3,"","Nível 3","Nível 3","-","AGETOP",null,"EXECUÇÃO DE DUAS SALAS DE AULA MODELO PRÓPRIO","-",null,null,null,0,""]
["S",3,"S",0,1,1,3,0,0,0,0,"","Serviço","Serviço","-","AGETOP",20121,"DEM. MANUAL EM CONCR.SIMPLES C/TR.ATE CB.E CARGA (O.C.)","m3    ",3.36,null,null,0,""]
["S",3,"S",0,1,1,3,0,0,0,0,"","Serviço","Serviço","-","COMPOSIÇÃO","COMP 010_SEE","DEMOLIÇÃO DE GRADE/GRELHA/CORRIMÃO/GUARDA CORPO - METÁLICO","M2",24.42,null,null,0,""]
[3,3,3,4,1,1,4,0,0,8,4,"","Nível 3","Nível 3","-","AGETOP",null,"REFORMA GERAL","-",null,null,null,0,""]
["S",3,"S",0,1,1,4,0,0,0,0,"","Serviço","Serviço","-","AGETOP",20106,"RETIRADA DE JANELAS OU PORTAIS C/ TRANSP. ATÉ CB. E CARGA","m2    ",0.75,null,null,0,""]
[{"$f":"CHOOSE(1+LOG(1+2*(ORÇAMENTO.Nivel=\"Nível 1\")+4*(ORÇAMENTO.Nivel=\"Nível 2\")+8*(ORÇAMENTO.Nivel=\"Nível 3\")+16*(ORÇAMENTO.Nivel=\"Nível 4\")+32*(ORÇAMENTO.Nivel=\"Serviço\"),2),0,1,2,3,4,\"S\")","v":"S"},{"$f":"IF(OR(C35=\"s\",C35=0),OFFSET(B35,-1,0),C35)","v":3},{"$f":"IF(OFFSET(C35,-1,0)=\"L\",1,IF(OFFSET(C35,-1,0)=1,2,IF(OR(A35=\"s\",A35=0),\"S\",IF(AND(OFFSET(C35,-1,0)=2,A35=4),3,IF(AND(OR(OFFSET(C35,-1,0)=\"s\",OFFSET(C35,-1,0)=0),A35<>\"s\",A35>OFFSET(B35,-1,0)),OFFSET(B35,-1,0),A35)))))","v":"S"},{"$f":"IF(OR(C35=\"S\",C35=0),0,IF(ISERROR(K35),J35,SMALL(J35:K35,1)))","v":0},{"$f":"IF($C35=1,OFFSET(E35,-1,0)+1,OFFSET(E35,-1,0))","v":1},{"$f":"IF($C35=1,0,IF($C35=2,OFFSET(F35,-1,0)+1,OFFSET(F35,-1,0)))","v":1},{"$f":"IF(AND($C35<=2,$C35<>0),0,IF($C35=3,OFFSET(G35,-1,0)+1,OFFSET(G35,-1,0)))","v":4},{"$f":"IF(AND($C35<=3,$C35<>0),0,IF($C35=4,OFFSET(H35,-1,0)+1,OFFSET(H35,-1,0)))","v":0},{"$f":"IF(AND($C35<=4,$C35<>0),0,IF(AND($C35=\"S\",$W35>0),OFFSET(I35,-1,0)+1,OFFSET(I35,-1,0)))","v":0},{"$f":"IF(OR($C35=\"S\",$C35=0),0,MATCH(0,OFFSET($D35,1,$C35,ROW($C$319)-ROW($C35)),0))","v":0},{"$f":"IF(OR($C35=\"S\",$C35=0),0,MATCH(OFFSET($D35,0,$C35)+1,OFFSET($D35,1,$C35,ROW($C$319)-ROW($C35)),0))","v":0},"","Serviço","Serviço","-","SINAPI",97644,"REMOÇÃO DE PORTAS, DE FORMA MANUAL, SEM REAPROVEITAMENTO. AF_12/2017","M2",3.36,null,null,0,"Referência: AGETOP - 20106"]
["S",3,"S",0,1,1,4,0,0,0,0,"","Serviço","Serviço","-","AGETOP",20118,"DEM.ALVEN.TIJOLO S/REAP. C/TR.ATE CB. E CARGA","m3    ",0.11,null,null,0,""]
[3,3,3,2,1,1,5,0,0,{"$f":"IF(OR($C37=\"S\",$C37=0),0,MATCH(0,OFFSET($D37,1,$C37,ROW($C$319)-ROW($C37)),0))","v":4},{"$f":"IF(OR($C37=\"S\",$C37=0),0,MATCH(OFFSET($D37,0,$C37)+1,OFFSET($D37,1,$C37,ROW($C$319)-ROW($C37)),0))","v":2},"","Nível 3","Nível 3","-","SINAPI",null,"CENTRAL DE GÁS","-",null,null,null,0,""]
["S",3,"S",0,1,1,5,0,0,0,0,"","Serviço","Serviço","-","AGETOP",20121,"DEM. MANUAL EM CONCR.SIMPLES C/TR.ATE CB.E CARGA (O.C.)","m3    ",0.1,null,null,0,""]
[3,3,3,2,1,1,6,0,0,{"$f":"IF(OR($C39=\"S\",$C39=0),0,MATCH(0,OFFSET($D39,1,$C39,ROW($C$319)-ROW($C39)),0))","v":2},{"$f":"IF(OR($C39=\"S\",$C39=0),0,MATCH(OFFSET($D39,0,$C39)+1,OFFSET($D39,1,$C39,ROW($C$319)-ROW($C39)),0))","v":{"$error":"#N/A"}},"","Nível 3","Nível 3","-","AGETOP",null,"OUTROS","-",null,null,null,0,""]
["S",3,"S",0,1,1,6,0,0,0,0,"","Serviço","Serviço","-","AGETOP",21301,"PLACA DE OBRA PLOTADA EM CHAPA METÁLICA 26 , AFIXADA EM CAVALETES DE MADEIRA DE LEI (VIGOTAS 6X12CM) - PADRÃO GOINFRA","m2    ",7.5,null,null,0,""]
[2,2,2,3,1,2,0,0,0,278,3,"","Nível 2","Nível 2","-","AGETOP",null,"TRANSPORTES","-",null,null,null,0,""]
["S",2,"S",0,1,2,0,0,0,0,0,"","Serviço","Serviço","-","SINAPI",72897,"CARGA MANUAL DE ENTULHO EM CAMINHAO BASCULANTE 6 M3","M3",7.69,null,null,0,""]
["S",2,"S",0,1,2,0,0,0,0,0,"","Serviço","Serviço","-","SINAPI",72900,"TRANSPORTE DE ENTULHO COM CAMINHAO BASCULANTE 6 M3, RODOVIA PAVIMENTADA, DMT 0,5 A 1,0 KM","M3",7.69,null,null,0,""]
[2,2,2,7,1,3,0,0,0,275,7,"","Nível 2","Nível 2","-","AGETOP",null,"SERVIÇO EM TERRA","-",null,null,null,0,""]
[3,3,3,3,1,3,1,0,0,6,3,"","Nível 3","Nível 3","-","AGETOP",null,"AMPLIAÇÃO DA ÁREA DE SERVIÇOS","-",null,null,null,0,""]
["S",3,"S",0,1,3,1,0,0,0,0,"","Serviço","Serviço","-","AGETOP",41003,"ATERRO INTERNO SEM APILOAM.C/TR.EM CARRINHO MÃO","m3    ",0.08,null,null,0,""]
["S",3,"S",0,1,3,1,0,0,0,0,"","Serviço","Serviço","-","AGETOP",41002,"APILOAMENTO","m2    ",1.66,null,null,0,""]
[3,3,3,3,1,3,2,0,0,{"$f":"IF(OR($C48=\"S\",$C48=0),0,MATCH(0,OFFSET($D48,1,$C48,ROW($C$319)-ROW($C48)),0))","v":3},{"$f":"IF(OR($C48=\"S\",$C48=0),0,MATCH(OFFSET($D48,0,$C48)+1,OFFSET($D48,1,$C48,ROW($C$319)-ROW($C48)),0))","v":13},"","Nível 3","Nível 3","-","SINAPI",null,"CENTRAL DE GÁS","-",null,null,null,0,""]
["S",3,"S",0,1,3,2,0,0,0,0,"","Serviço","Serviço","-","SINAPI",93358,"ESCAVAÇÃO MANUAL DE VALA COM PROFUNDIDADE MENOR OU IGUAL A 1,30 M. AF_03/2016","M3",0.49,null,null,0,"Referência: AGETOP - 40101"]
["S",3,"S",0,1,3,2,0,0,0,0,"","Serviço","Serviço","-","SINAPI",96995,"REATERRO MANUAL APILOADO COM SOQUETE. AF_10/2017","M3",0.49,null,null,0,"Referência: AGETOP - 40902"]
[2,2,2,19,1,4,0,0,0,{"$f":"IF(OR($C51=\"S\",$C51=0),0,MATCH(0,OFFSET($D51,1,$C51,ROW($C$319)-ROW($C51)),0))","v":268},{"$f":"IF(OR($C51=\"S\",$C51=0),0,MATCH(OFFSET($D51,0,$C51)+1,OFFSET($D51,1,$C51,ROW($C$319)-ROW($C51)),0))","v":19},"","Nível 2","Nível 2","-","AGETOP",null,"FUNDAÇÕES E SONDAGENS","-",null,null,null,0,""]
[3,3,3,4,1,4,1,0,0,18,4,"","Nível 3","Nível 3","-","SINAPI",null,"ESTACAS","-",null,null,null,0,""]
["S",3,"S",0,1,4,1,0,0,0,0,"","Serviço","Serviço","-","SINAPI",98230,"ESTACA BROCA DE CONCRETO, DIÂMETRO DE 30 CM, PROFUNDIDADE DE ATÉ 3 M, ESCAVAÇÃO MANUAL COM TRADO CONCHA, NÃO ARMADA. AF_03/2018","M",88,null,null,0,"Referência: AGETOP - 50302"]
["S",3,"S",0,1,4,1,0,0,0,0,"","Serviço","Serviço","-","SINAPI",96546,"ARMAÇÃO DE BLOCO, VIGA BALDRAME OU SAPATA UTILIZANDO AÇO CA-50 DE 10 MM - MONTAGEM. AF_06/2017","KG",264,null,null,0,"Referência: AGETOP - 52005"]
["S",3,"S",0,1,4,1,0,0,0,0,"","Serviço","Serviço","-","SINAPI",96543,"ARMAÇÃO DE BLOCO, VIGA BALDRAME E SAPATA UTILIZANDO AÇO CA-60 DE 5 MM - MONTAGEM. AF_06/2017","KG",87.18,null,null,0,"Referência: AGETOP - 52014"]
[3,3,3,5,1,4,2,0,0,14,5,"","Nível 3","Nível 3","-","SINAPI",null,"BLOCOS","-",null,null,null,0,""]
["S",3,"S",0,1,4,2,0,0,0,0,"","Serviço","Serviço","-","SINAPI",96522,"ESCAVAÇÃO MANUAL PARA BLOCO DE COROAMENTO OU SAPATA, SEM PREVISÃO DE FÔRMA. AF_06/2017","M3",4.75,null,null,0,"Referência: AGETOP - 50901"]
["S",3,"S",0,1,4,2,0,0,0,0,"","Serviço","Serviço","-","AGETOP",50902,"APILOAMENTO (BLOCOS/SAPATAS)","m2    ",7.92,null,null,0,""]
[{"$f":"CHOOSE(1+LOG(1+2*(ORÇAMENTO.Nivel=\"Nível 1\")+4*(ORÇAMENTO.Nivel=\"Nível 2\")+8*(ORÇAMENTO.Nivel=\"Nível 3\")+16*(ORÇAMENTO.Nivel=\"Nível 4\")+32*(ORÇAMENTO.Nivel=\"Serviço\"),2),0,1,2,3,4,\"S\")","v":"S"},{"$f":"IF(OR(C59=\"s\",C59=0),OFFSET(B59,-1,0),C59)","v":3},{"$f":"IF(OFFSET(C59,-1,0)=\"L\",1,IF(OFFSET(C59,-1,0)=1,2,IF(OR(A59=\"s\",A59=0),\"S\",IF(AND(OFFSET(C59,-1,0)=2,A59=4),3,IF(AND(OR(OFFSET(C59,-1,0)=\"s\",OFFSET(C59,-1,0)=0),A59<>\"s\",A59>OFFSET(B59,-1,0)),OFFSET(B59,-1,0),A59)))))","v":"S"},{"$f":"IF(OR(C59=\"S\",C59=0),0,IF(ISERROR(K59),J59,SMALL(J59:K59,1)))","v":0},{"$f":"IF($C59=1,OFFSET(E59,-1,0)+1,OFFSET(E59,-1,0))","v":1},{"$f":"IF($C59=1,0,IF($C59=2,OFFSET(F59,-1,0)+1,OFFSET(F59,-1,0)))","v":4},{"$f":"IF(AND($C59<=2,$C59<>0),0,IF($C59=3,OFFSET(G59,-1,0)+1,OFFSET(G59,-1,0)))","v":2},{"$f":"IF(AND($C59<=3,$C59<>0),0,IF($C59=4,OFFSET(H59,-1,0)+1,OFFSET(H59,-1,0)))","v":0},{"$f":"IF(AND($C59<=4,$C59<>0),0,IF(AND($C59=\"S\",$W59>0),OFFSET(I59,-1,0)+1,OFFSET(I59,-1,0)))","v":0},0,0,"","Serviço","Serviço","-","AGETOP",51027,"LASTRO DE BRITA (OBRAS CIVIS)","m3    ",0.39,null,null,0,""]
["S",3,"S",0,1,4,2,0,0,0,0,"","Serviço","Serviço","-","SINAPI",96543,"ARMAÇÃO DE BLOCO, VIGA BALDRAME E SAPATA UTILIZANDO AÇO CA-60 DE 5 MM - MONTAGEM. AF_06/2017","KG",51,null,null,0,"Referência: AGETOP - 52014"]
[3,3,3,9,1,4,3,0,0,9,27,"","Nível 3","Nível 3","-","SINAPI",null,"VIGAS BALDRAMES","-",null,null,null,0,""]
["S",3,"S",0,1,4,3,0,0,0,0,"","Serviço","Serviço","-","SINAPI",96527,"ESCAVAÇÃO MANUAL DE VALA PARA VIGA BALDRAME, COM PREVISÃO DE FÔRMA. AF_06/2017","M3",5.08,null,null,0,"Referência: AGETOP - 40101"]
["S",3,"S",0,1,4,3,0,0,0,0,"","Serviço","Serviço","-","SINAPI",96995,"REATERRO MANUAL APILOADO COM SOQUETE. AF_10/2017","M3",2.9,null,null,0,"Referência: AGETOP - 40902"]
["S",3,"S",0,1,4,3,0,0,0,0,"","Serviço","Serviço","-","AGETOP",60191,"FORMA DE TABUA CINTA BALDRAME U=8 VEZES","m2    ",37.83,null,null,0,""]
["S",3,"S",0,1,4,3,0,0,0,0,"","Serviço","Serviço","-","SINAPI",94965,"CONCRETO FCK = 25MPA, TRAÇO 1:2,3:2,7 (CIMENTO/ AREIA MÉDIA/ BRITA 1)  - PREPARO MECÂNICO COM BETONEIRA 400 L. AF_07/2016","M3",2.1800000000000002,null,null,0,"Referência: AGETOP - 51030"]
["S",3,"S",0,1,4,3,0,0,0,0,"","Serviço","Serviço","-","SINAPI","74157/4","LANCAMENTO/APLICACAO MANUAL DE CONCRETO EM FUNDACOES","M3",2.1800000000000002,null,null,0,"Referência: AGETOP - 51026"]
["S",3,"S",0,1,4,3,0,0,0,0,"","Serviço","Serviço","-","SINAPI",96545,"ARMAÇÃO DE BLOCO, VIGA BALDRAME OU SAPATA UTILIZANDO AÇO CA-50 DE 8 MM - MONTAGEM. AF_06/2017","KG",82.81,null,null,0,"Referência: AGETOP - 52004"]
["S",3,"S",0,1,4,3,0,0,0,0,"","Serviço","Serviço","-","SINAPI",96546,"ARMAÇÃO DE BLOCO, VIGA BALDRAME OU SAPATA UTILIZANDO AÇO CA-50 DE 10 MM - MONTAGEM. AF_06/2017","KG",14.45,null,null,0,"Referência: AGETOP - 52005"]
["S",3,"S",0,1,4,3,0,0,0,0,"","Serviço","Serviço","-","SINAPI",96543,"ARMAÇÃO DE BLOCO, VIGA BALDRAME E SAPATA UTILIZANDO AÇO CA-60 DE 5 MM - MONTAGEM. AF_06/2017","KG",45,null,null,0,"Referência: AGETOP - 52014"]
[2,2,2,27,1,5,0,0,0,249,27,"","Nível 2","Nível 2","-","AGETOP",null,"ESTRUTURA","-",null,null,null,0,""]
[3,3,3,6,1,5,1,0,0,26,6,"","Nível 3","Nível 3","-","AGETOP",null,"PILARES","-",null,null,null,0,""]
["S",3,"S",0,1,5,1,0,0,0,0,"","Serviço","Serviço","-","SINAPI",92426,"MONTAGEM E DESMONTAGEM DE FÔRMA DE PILARES RETANGULARES E ESTRUTURAS SIMILARES COM ÁREA MÉDIA DAS SEÇÕES MENOR OU IGUAL A 0,25 M², PÉ-DIREITO SIMPLES, EM CHAPA DE MADEIRA COMPENSADA RESINADA, 8 UTILIZAÇÕES. AF_12/2015","M2",51.86,null,null,0,""]
["S",3,"S",0,1,5,1,0,0,0,0,"","Serviço","Serviço","-","SINAPI",94965,"CONCRETO FCK = 25MPA, TRAÇO 1:2,3:2,7 (CIMENTO/ AREIA MÉDIA/ BRITA 1)  - PREPARO MECÂNICO COM BETONEIRA 400 L. AF_07/2016","M3",2.5,null,null,0,"Referência: AGETOP - 51030"]
["S",3,"S",0,1,5,1,0,0,0,0,"","Serviço","Serviço","-","SINAPI",92873,"LANÇAMENTO COM USO DE BALDES, ADENSAMENTO E ACABAMENTO DE CONCRETO EM ESTRUTURAS. AF_12/2015","M3",2.5,null,null,0,"Referência: AGETOP - 60801"]
["S",3,"S",0,1,5,1,0,0,0,0,"","Serviço","Serviço","-","SINAPI",92778,"ARMAÇÃO DE PILAR OU VIGA DE UMA ESTRUTURA CONVENCIONAL DE CONCRETO ARMADO EM UMA EDIFICAÇÃO TÉRREA OU SOBRADO UTILIZANDO AÇO CA-50 DE 10,0 MM - MONTAGEM. AF_12/2015","KG",189.36,null,null,0,"Referência: AGETOP - 60305"]
["S",3,"S",0,1,5,1,0,0,0,0,"","Serviço","Serviço","-","SINAPI",92775,"ARMAÇÃO DE PILAR OU VIGA DE UMA ESTRUTURA CONVENCIONAL DE CONCRETO ARMADO EM UMA EDIFICAÇÃO TÉRREA OU SOBRADO UTILIZANDO AÇO CA-60 DE 5,0 MM - MONTAGEM. AF_12/2015","KG",67.540000000000006,null,null,0,"Referência: AGETOP - 60314"]
[3,3,3,6,1,5,2,0,0,20,6,"","Nível 3","Nível 3","-",null,null,"VIGAS DE COBERTURA","-",null,null,null,0,""]
["S",3,"S",0,1,5,2,0,0,0,0,"","Serviço","Serviço","-","SINAPI",92464,"MONTAGEM E DESMONTAGEM DE FÔRMA DE VIGA, ESCORAMENTO METÁLICO, PÉ-DIREITO SIMPLES, EM CHAPA DE MADEIRA RESINADA, 8 UTILIZAÇÕES. AF_12/2015","M2",55.08,null,null,0,"Referência: AGETOP - 60209"]
["S",3,"S",0,1,5,2,0,0,0,0,"","Serviço","Serviço","-","SINAPI",94965,"CONCRETO FCK = 25MPA, TRAÇO 1:2,3:2,7 (CIMENTO/ AREIA MÉDIA/ BRITA 1)  - PREPARO MECÂNICO COM BETONEIRA 400 L. AF_07/2016","M3",3.18,null,null,0,"Referência: AGETOP - 51030"]
["S",3,"S",0,1,5,2,0,0,0,0,"","Serviço","Serviço","-","SINAPI",92873,"LANÇAMENTO COM USO DE BALDES, ADENSAMENTO E ACABAMENTO DE CONCRETO EM ESTRUTURAS. AF_12/2015","M3",3.18,null,null,0,"Referência: AGETOP - 60801"]
["S",3,"S",0,1,5,2,0,0,0,0,"","Serviço","Serviço","-","SINAPI",92777,"ARMAÇÃO DE PILAR OU VIGA DE UMA ESTRUTURA CONVENCIONAL DE CONCRETO ARMADO EM UMA EDIFICAÇÃO TÉRREA OU SOBRADO UTILIZANDO AÇO CA-50 DE 8,0 MM - MONTAGEM. AF_12/2015","KG",134.44999999999999,null,null,0,"Referência: AGETOP - 60304"]
["S",3,"S",0,1,5,2,0,0,0,0,"","Serviço","Serviço","-","SINAPI",92775,"ARMAÇÃO DE PILAR OU VIGA DE UMA ESTRUTURA CONVENCIONAL DE CONCRETO ARMADO EM UMA EDIFICAÇÃO TÉRREA OU SOBRADO UTILIZANDO AÇO CA-60 DE 5,0 MM - MONTAGEM. AF_12/2015","KG",64.81,null,null,0,"Referência: AGETOP - 60314"]
[3,3,3,5,1,5,3,0,0,14,5,"","Nível 3","Nível 3","-",null,null,"LAJE","-",null,null,null,0,""]
["S",3,"S",0,1,5,3,0,0,0,0,"","Serviço","Serviço","-","SINAPI",92267,"FABRICAÇÃO DE FÔRMA PARA LAJES, EM CHAPA DE MADEIRA COMPENSADA RESINADA, E = 17 MM. AF_12/2015","M2",18.239999999999998,null,null,0,""]
["S",3,"S",0,1,5,3,0,0,0,0,"","Serviço","Serviço","-","SINAPI",94965,"CONCRETO FCK = 25MPA, TRAÇO 1:2,3:2,7 (CIMENTO/ AREIA MÉDIA/ BRITA 1)  - PREPARO MECÂNICO COM BETONEIRA 400 L. AF_07/2016","M3",2.37,null,null,0,"Referência: AGETOP - 51030"]
["S",3,"S",0,1,5,3,0,0,0,0,"","Serviço","Serviço","-","SINAPI",92873,"LANÇAMENTO COM USO DE BALDES, ADENSAMENTO E ACABAMENTO DE CONCRETO EM ESTRUTURAS. AF_12/2015","M3",2.37,null,null,0,"Referência: AGETOP - 60801"]
["S",3,"S",0,1,5,3,0,0,0,0,"","Serviço","Serviço","-","SINAPI",92784,"ARMAÇÃO DE LAJE DE UMA ESTRUTURA CONVENCIONAL DE CONCRETO ARMADO EM UMA EDIFICAÇÃO TÉRREA OU SOBRADO UTILIZANDO AÇO CA-60 DE 5,0 MM - MONTAGEM. AF_12/2015","KG",42.9,null,null,0,"Referência: AGETOP - 60314"]
[3,3,3,9,1,5,4,0,0,9,{"$error":"#N/A"},"","Nível 3","Nível 3","-","SINAPI",null,"OUTROS","-",null,null,null,0,""]
[4,4,4,3,1,5,4,1,0,8,3,"","Nível 4","Nível 4","-","SINAPI",null,"AMPLIAÇÃO DA ÁREA DE SERVIÇOS","-",null,null,null,0,""]
["S",4,"S",0,1,5,4,1,0,0,0,"","Serviço","Serviço","-","AGETOP",61130,"MURO ARRIMO PADRÃO GOINFRA EM CANALETA SEM REVESTIMENTO-(COM ALTURA ATÉ 2,50M)-INCLUSO FUNDAÇÃO","m2    ",3.57,null,null,0,""]
["S",4,"S",0,1,5,4,1,0,0,0,"","Serviço","Serviço","-","AGETOP",60010,"VERGA/CONTRAVERGA EM CONCRETO ARMADO FCK = 20 MPA","m3    ",0.05,null,null,0,""]
[4,4,4,3,1,5,4,2,0,5,3,"","Nível 4","Nível 4","-","SINAPI",null,"EXECUÇÃO DE DUAS SALAS DE AULA MODELO PRÓPRIO","-",null,null,null,0,""]
["S",4,"S",0,1,5,4,2,0,0,0,"","Serviço","Serviço","-","AGETOP",61130,"MURO ARRIMO PADRÃO GOINFRA EM CANALETA SEM REVESTIMENTO-(COM ALTURA ATÉ 2,50M)-INCLUSO FUNDAÇÃO","m2    ",11.2,null,null,0,""]
["S",4,"S",0,1,5,4,2,0,0,0,"","Serviço","Serviço","-","AGETOP",60010,"VERGA/CONTRAVERGA EM CONCRETO ARMADO FCK = 20 MPA","m3    ",0.23,null,null,0,""]
[{"$f":"CHOOSE(1+LOG(1+2*(ORÇAMENTO.Nivel=\"Nível 1\")+4*(ORÇAMENTO.Nivel=\"Nível 2\")+8*(ORÇAMENTO.Nivel=\"Nível 3\")+16*(ORÇAMENTO.Nivel=\"Nível 4\")+32*(ORÇAMENTO.Nivel=\"Serviço\"),2),0,1,2,3,4,\"S\")","v":4},4,4,2,1,5,4,3,0,2,50,"","Nível 4","Nível 4","-","SINAPI",null,"REFORMA GERAL","-",null,null,null,0,""]
[{"$f":"CHOOSE(1+LOG(1+2*(ORÇAMENTO.Nivel=\"Nível 1\")+4*(ORÇAMENTO.Nivel=\"Nível 2\")+8*(ORÇAMENTO.Nivel=\"Nível 3\")+16*(ORÇAMENTO.Nivel=\"Nível 4\")+32*(ORÇAMENTO.Nivel=\"Serviço\"),2),0,1,2,3,4,\"S\")","v":"S"},4,"S",0,1,5,4,3,0,0,0,"","Serviço","Serviço","-","AGETOP",60010,"VERGA/CONTRAVERGA EM CONCRETO ARMADO FCK = 20 MPA","m3    ",0.03,null,null,0,""]
[{"$f":"CHOOSE(1+LOG(1+2*(ORÇAMENTO.Nivel=\"Nível 1\")+4*(ORÇAMENTO.Nivel=\"Nível 2\")+8*(ORÇAMENTO.Nivel=\"Nível 3\")+16*(ORÇAMENTO.Nivel=\"Nível 4\")+32*(ORÇAMENTO.Nivel=\"Serviço\"),2),0,1,2,3,4,\"S\")","v":2},2,2,31,1,6,0,0,0,222,31,"","Nível 2","Nível 2","-","AGETOP",null,"INSTALAÇÕES ELÉTRICAS","-",null,null,null,0,""]
["S",2,"S",0,1,6,0,0,0,0,0,"","Serviço","Serviço","-","AGETOP",70351,"BRACADEIRA METALICA TIPO \"U\" DIAM. 3/4\"","Un    ",39,null,null,0,""]
["S",2,"S",0,1,6,0,0,0,0,0,"","Serviço","Serviço","-","AGETOP",70352,"BRACADEIRA METALICA TIPO \"U\" DIAM. 1\"","Un    ",22,null,null,0,""]
["S",2,"S",0,1,6,0,0,0,0,0,"","Serviço","Serviço","-","AGETOP",70421,"BUCHA E ARRUELA METALICA DIAM. 3/4\"","PR    ",39,null,null,0,""]
["S",2,"S",0,1,6,0,0,0,0,0,"","Serviço","Serviço","-","AGETOP",70422,"BUCHA E ARRUELA METALICA DIAM. 1\"","PR    ",22,null,null,0,""]
["S",2,"S",0,1,6,0,0,0,0,0,"","Serviço","Serviço","-","AGETOP",70391,"BUCHA DE NYLON S-6","Un    ",61,null,null,0,""]
["S",2,"S",0,1,6,0,0,0,0,0,"","Serviço","Serviço","-","SINAPI",91927,"CABO DE COBRE FLEXÍVEL ISOLADO, 2,5 MM², ANTI-CHAMA 0,6/1,0 KV, PARA CIRCUITOS TERMINAIS - FORNECIMENTO E INSTALAÇÃO. AF_12/2015","M",375,null,null,0,"Referência: AGETOP - 70581"]
["S",{"$f":"IF(OR(C104=\"s\",C104=0),OFFSET(B104,-1,0),C104)","v":2},{"$f":"IF(OFFSET(C104,-1,0)=\"L\",1,IF(OFFSET(C104,-1,0)=1,2,IF(OR(A104=\"s\",A104=0),\"S\",IF(AND(OFFSET(C104,-1,0)=2,A104=4),3,IF(AND(OR(OFFSET(C104,-1,0)=\"s\",OFFSET(C104,-1,0)=0),A104<>\"s\",A104>OFFSET(B104,-1,0)),OFFSET(B104,-1,0),A104)))))","v":"S"},{"$f":"IF(OR(C104=\"S\",C104=0),0,IF(ISERROR(K104),J104,SMALL(J104:K104,1)))","v":0},{"$f":"IF($C104=1,OFFSET(E104,-1,0)+1,OFFSET(E104,-1,0))","v":1},{"$f":"IF($C104=1,0,IF($C104=2,OFFSET(F104,-1,0)+1,OFFSET(F104,-1,0)))","v":6},{"$f":"IF(AND($C104<=2,$C104<>0),0,IF($C104=3,OFFSET(G104,-1,0)+1,OFFSET(G104,-1,0)))","v":0},{"$f":"IF(AND($C104<=3,$C104<>0),0,IF($C104=4,OFFSET(H104,-1,0)+1,OFFSET(H104,-1,0)))","v":0},{"$f":"IF(AND($C104<=4,$C104<>0),0,IF(AND($C104=\"S\",$W104>0),OFFSET(I104,-1,0)+1,OFFSET(I104,-1,0)))","v":0},0,0,"","Serviço","Serviço","-","SINAPI",91929,"CABO DE COBRE FLEXÍVEL ISOLADO, 4 MM², ANTI-CHAMA 0,6/1,0 KV, PARA CIRCUITOS TERMINAIS - FORNECIMENTO E INSTALAÇÃO. AF_12/2015","M",170,null,null,0,"Referência: AGETOP - 70582"]
["S",2,"S",0,1,6,0,0,0,0,0,"","Serviço","Serviço","-","SINAPI",92866,"CAIXA SEXTAVADA 3\" X 3\", METÁLICA, INSTALADA EM LAJE - FORNECIMENTO E INSTALAÇÃO. AF_12/2015","UN",13,null,null,0,"Referência: AGETOP - 70680"]
["S",2,"S",0,1,6,0,0,0,0,0,"","Serviço","Serviço","-","SINAPI",92868,"CAIXA RETANGULAR 4\" X 2\" MÉDIA (1,30 M DO PISO), METÁLICA, INSTALADA EM PAREDE - FORNECIMENTO E INSTALAÇÃO. AF_12/2015","UN",11,null,null,0,"Referência: AGETOP - 70691"]
["S",2,"S",0,1,6,0,0,0,0,0,"","Serviço","Serviço","-","SINAPI",95818,"CONDULETE DE PVC, TIPO X, PARA ELETRODUTO DE PVC SOLDÁVEL DN 32 MM (1''), APARENTE - FORNECIMENTO E INSTALAÇÃO. AF_11/2016","UN",4,null,null,0,""]
["S",2,"S",0,1,6,0,0,0,0,0,"","Serviço","Serviço","-","AGETOP",70925,"CONDULETE DE PVC - ADAPTADOR DE SAÍDA 3/4\"  ","un    ",3,null,null,0,""]
["S",2,"S",0,1,6,0,0,0,0,0,"","Serviço","Serviço","-","SINAPI",91902,"CURVA 90 GRAUS PARA ELETRODUTO, PVC, ROSCÁVEL, DN 25 MM (3/4\"), PARA CIRCUITOS TERMINAIS, INSTALADA EM LAJE - FORNECIMENTO E INSTALAÇÃO. AF_12/2015","UN",2,null,null,0,"Referência: AGETOP - 71141"]
["S",2,"S",0,1,6,0,0,0,0,0,"","Serviço","Serviço","-","SINAPI",91905,"CURVA 90 GRAUS PARA ELETRODUTO, PVC, ROSCÁVEL, DN 32 MM (1\"), PARA CIRCUITOS TERMINAIS, INSTALADA EM LAJE - FORNECIMENTO E INSTALAÇÃO. AF_12/2015","UN",5,null,null,0,"Referência: AGETOP - 71142"]
["S",2,"S",0,1,6,0,0,0,0,0,"","Serviço","Serviço","-","SINAPI",93653,"DISJUNTOR MONOPOLAR TIPO DIN, CORRENTE NOMINAL DE 10A - FORNECIMENTO E INSTALAÇÃO. AF_04/2016","UN",3,null,null,0,""]
["S",2,"S",0,1,6,0,0,0,0,0,"","Serviço","Serviço","-","SINAPI",93654,"DISJUNTOR MONOPOLAR TIPO DIN, CORRENTE NOMINAL DE 16A - FORNECIMENTO E INSTALAÇÃO. AF_04/2016","UN",2,null,null,0,""]
["S",2,"S",0,1,6,0,0,0,0,0,"","Serviço","Serviço","-","AGETOP",71184,"DISPOSITIVO DE PROTEÇÃO CONTRA SURTOS (D.P.S.) 275V DE 8 A 40KA","Un    ",3,null,null,0,""]
["S",2,"S",0,1,6,0,0,0,0,0,"","Serviço","Serviço","-","SINAPI",91844,"ELETRODUTO FLEXÍVEL CORRUGADO, PVC, DN 25 MM (3/4\"), PARA CIRCUITOS TERMINAIS, INSTALADO EM LAJE - FORNECIMENTO E INSTALAÇÃO. AF_12/2015","M",65,null,null,0,""]
["S",2,"S",0,1,6,0,0,0,{"$f":"IF(OR($C115=\"S\",$C115=0),0,MATCH(0,OFFSET($D115,1,$C115,ROW($C$319)-ROW($C115)),0))","v":0},{"$f":"IF(OR($C115=\"S\",$C115=0),0,MATCH(OFFSET($D115,0,$C115)+1,OFFSET($D115,1,$C115,ROW($C$319)-ROW($C115)),0))","v":0},"","Serviço","Serviço","-","SINAPI",91846,"ELETRODUTO FLEXÍVEL CORRUGADO, PVC, DN 32 MM (1\"), PARA CIRCUITOS TERMINAIS, INSTALADO EM LAJE - FORNECIMENTO E INSTALAÇÃO. AF_12/2015","M",10,null,null,0,""]
["S",2,"S",0,1,6,0,0,0,0,0,"","Serviço","Serviço","-","SINAPI",91871,"ELETRODUTO RÍGIDO ROSCÁVEL, PVC, DN 25 MM (3/4\"), PARA CIRCUITOS TERMINAIS, INSTALADO EM PAREDE - FORNECIMENTO E INSTALAÇÃO. AF_12/2015","M",30,null,null,0,"Referência: AGETOP - 71201"]
["S",2,"S",0,1,6,0,0,0,0,0,"","Serviço","Serviço","-","SINAPI",91872,"ELETRODUTO RÍGIDO ROSCÁVEL, PVC, DN 32 MM (1\"), PARA CIRCUITOS TERMINAIS, INSTALADO EM PAREDE - FORNECIMENTO E INSTALAÇÃO. AF_12/2015","M",20,null,null,0,"Referência: AGETOP - 71202"]
["S",2,"S",0,1,6,0,0,0,0,0,"","Serviço","Serviço","-","AGETOP",71321,"FITA DE AUTO FUSAO, ROLO E 10,00 MM","Un    ",1,null,null,0,""]
["S",2,"S",0,1,6,0,0,0,0,0,"","Serviço","Serviço","-","AGETOP",71331,"FITA ISOLANTE, ROLO DE 20,00 M","Un    ",2,null,null,0,""]
["S",2,"S",0,1,6,0,0,0,0,0,"","Serviço","Serviço","-","SINAPI",91955,"INTERRUPTOR PARALELO (1 MÓDULO), 10A/250V, INCLUINDO SUPORTE E PLACA - FORNECIMENTO E INSTALAÇÃO. AF_12/2015","UN",3,null,null,0,"Referência: AGETOP - 71431"]
["S",2,"S",0,1,6,0,0,0,0,0,"","Serviço","Serviço","-","COMPOSIÇÃO","COMP 387_SEE","LÂMPADA LED TUBULAR 18W ","UN ",26,null,null,0,""]
["S",2,"S",0,1,6,0,0,0,0,0,"","Serviço","Serviço","-","SINAPI",97585,"LUMINÁRIA TIPO CALHA, DE SOBREPOR, COM 2 LÂMPADAS TUBULARES DE 18 W - FORNECIMENTO E INSTALAÇÃO. AF_11/2017","UN",13,null,null,0,""]
["S",2,"S",0,1,6,0,0,0,0,0,"","Serviço","Serviço","-","AGETOP",71615,"LUMINÁRIA TIPO ARANDELA DE USO EXTERNO - BASE E-27","un    ",12,null,null,0,""]
["S",2,"S",0,1,6,0,0,0,0,0,"","Serviço","Serviço","-","SINAPI",91884,"LUVA PARA ELETRODUTO, PVC, ROSCÁVEL, DN 25 MM (3/4\"), PARA CIRCUITOS TERMINAIS, INSTALADA EM PAREDE - FORNECIMENTO E INSTALAÇÃO. AF_12/2015","UN",39,null,null,0,"Referência: AGETOP - 71741"]
["S",2,"S",0,1,6,0,0,0,0,0,"","Serviço","Serviço","-","SINAPI",91885,"LUVA PARA ELETRODUTO, PVC, ROSCÁVEL, DN 32 MM (1\"), PARA CIRCUITOS TERMINAIS, INSTALADA EM PAREDE - FORNECIMENTO E INSTALAÇÃO. AF_12/2015","UN",1,null,null,0,"Referência: AGETOP - 71742"]
["S",2,"S",0,1,6,0,0,0,0,0,"","Serviço","Serviço","-","AGETOP",71861,"PARAFUSO P/BUCHA S-6","Un    ",61,null,null,0,""]
["S",2,"S",0,1,6,0,0,0,0,0,"","Serviço","Serviço","-","SINAPI",91996,"TOMADA MÉDIA DE EMBUTIR (1 MÓDULO), 2P+T 10 A, INCLUINDO SUPORTE E PLACA - FORNECIMENTO E INSTALAÇÃO. AF_12/2015","UN",8,null,null,0,"Referência: AGETOP - 72578"]
[2,2,2,50,1,7,0,0,0,191,50,"","Nível 2","Nível 2","-","AGETOP",null,"INSTALAÇÕES HIDROSSANITÁRIAS","-",null,null,null,0,""]
[3,3,3,8,1,7,1,0,0,49,8,"","Nível 3","Nível 3","-","SINAPI",null,"PEÇAS E ACESSÓRIOS","-",null,null,null,0,""]
[4,4,4,5,1,7,1,1,0,7,5,"","Nível 4","Nível 4","-","SINAPI",null,"PIA E ACESSÓRIOS","-",null,null,null,0,""]
["S",4,"S",0,1,7,1,1,0,0,0,"","Serviço","Serviço","-","AGETOP",80810,"TORNEIRA DE PAREDE PARA TANQUE COM AREJADOR DIÂMETRO DE 1/2\" E 3/4\"","Un    ",2,null,null,0,""]
["S",4,"S",0,1,7,1,1,0,0,0,"","Serviço","Serviço","-","AGETOP",80820,"SIFAO P/TANQUE 1\" X 1.1/2\" - PVC","Un    ",2,null,null,0,""]
["S",4,"S",0,1,7,1,1,0,0,0,"","Serviço","Serviço","-","AGETOP",80830,"VALVULA P/TANQUE METALICA DIAM.1\" S/LADRAO","Un    ",2,null,null,0,""]
["S",4,"S",0,1,7,1,1,0,0,0,"","Serviço","Serviço","-","SINAPI",86874,"TANQUE DE LOUÇA BRANCA SUSPENSO, 18L OU EQUIVALENTE - FORNECIMENTO E INSTALAÇÃO. AF_12/2013","UN",2,null,null,0,""]
[4,4,4,2,1,7,1,2,0,2,7,"","Nível 4","Nível 4","-","SINAPI",null,"REGISTROS","-",null,null,null,0,""]
["S",4,"S",0,1,7,1,2,0,0,0,"","Serviço","Serviço","-","AGETOP",80926,"REGISTRO DE GAVETA C/CANOPLA DIAMETRO 3/4\"","Un    ",1,null,null,0,""]
[3,3,3,21,1,7,2,0,0,41,21,"","Nível 3","Nível 3","-","SINAPI",null,"ÁGUA FRIA","-",null,null,null,0,""]
[4,4,4,2,1,7,2,1,0,20,2,"","Nível 4","Nível 4","-","SINAPI",null,"TUBOS DE PVC SOLDÁVEL","-",null,null,null,0,""]
["S",4,"S",0,1,7,2,1,0,0,0,"","Serviço","Serviço","-","SINAPI",89402,"TUBO, PVC, SOLDÁVEL, DN 25MM, INSTALADO EM RAMAL DE DISTRIBUIÇÃO DE ÁGUA - FORNECIMENTO E INSTALAÇÃO. AF_12/2014","M",12,null,null,0,"Referência: AGETOP - 81003"]
[4,4,4,2,1,7,2,2,0,18,2,"","Nível 4","Nível 4","-","SINAPI",null,"ADAPTADORES DE PVC SOLDÁVEL","-",null,null,null,0,""]
["S",4,"S",0,1,7,2,2,0,0,0,"","Serviço","Serviço","-","SINAPI",89538,"ADAPTADOR CURTO COM BOLSA E ROSCA PARA REGISTRO, PVC, SOLDÁVEL, DN 25MM X 3/4\u0094, INSTALADO EM PRUMADA DE ÁGUA - FORNECIMENTO E INSTALAÇÃO. AF_12/2014","UN",2,null,null,0,""]
[4,4,4,3,1,7,2,3,0,16,3,"","Nível 4","Nível 4","-","SINAPI",null,"CAP","-",null,null,null,0,""]
["S",4,"S",0,1,7,2,3,0,0,0,"","Serviço","Serviço","-","AGETOP",81232,"CAP PVC ROSCAVEL DIAMETRO 3/4\" (25 mm)","Un    ",2,null,null,0,""]
["S",4,"S",0,1,7,2,3,0,0,0,"","Serviço","Serviço","-","AGETOP",81258,"CAP PVC SOLDAVEL DIAMETRO 110 mm","Un    ",2,null,null,0,""]
[4,4,4,3,1,7,2,4,0,13,3,"","Nível 4","Nível 4","-","SINAPI",null,"JOELHO","-",3,null,null,0,""]
["S",4,"S",0,1,7,2,4,0,0,0,"","Serviço","Serviço","-","AGETOP",81360,"JOELHO RED.90 GRAUS SOLD.C/BUCHA LATAO 25X1/2\"","Un    ",1,null,null,0,""]
["S",4,"S",0,1,7,2,4,0,0,0,"","Serviço","Serviço","-","SINAPI",89409,"JOELHO 45 GRAUS, PVC, SOLDÁVEL, DN 25MM, INSTALADO EM RAMAL DE DISTRIBUIÇÃO DE ÁGUA - FORNECIMENTO E INSTALAÇÃO. AF_12/2014","UN",4,null,null,0,""]
[4,4,4,3,1,7,2,5,0,10,3,"","Nível 4","Nível 4","-","SINAPI",null,"TÊ","-",null,null,null,0,""]
["S",4,"S",0,1,7,2,5,0,0,0,"","Serviço","Serviço","-","SINAPI",89617,"TE, PVC, SOLDÁVEL, DN 25MM, INSTALADO EM PRUMADA DE ÁGUA - FORNECIMENTO E INSTALAÇÃO. AF_12/2014","UN",1,null,null,0,""]
["S",4,"S",0,1,7,2,5,0,0,0,"","Serviço","Serviço","-","AGETOP",81444,"TE 90 GR.SOLD.C/BUC.LATAO NA BOLSA CENT.25X25X3/4\"","Un    ",1,null,null,0,""]
[4,4,4,2,1,7,2,6,0,7,2,"","Nível 4","Nível 4","-","SINAPI",null,"LUVAS","-",null,null,null,0,""]
["S",4,"S",0,1,7,2,6,0,0,0,"","Serviço","Serviço","-","SINAPI",89379,"LUVA DE CORRER, PVC, SOLDÁVEL, DN 25MM, INSTALADO EM RAMAL OU SUB-RAMAL DE ÁGUA - FORNECIMENTO E INSTALAÇÃO. AF_12/2014","UN",2,null,null,0,""]
[4,4,4,3,1,7,2,7,0,5,3,"","Nível 4","Nível 4","-","SINAPI",null,"ADESIVOS","-",null,null,null,0,""]
["S",4,"S",0,1,7,2,7,0,0,0,"","Serviço","Serviço","-","AGETOP",81501,"ADESIVO PLASTICO - FRASCO 850 G","Un    ",1,null,null,0,""]
["S",4,"S",0,1,7,2,7,0,0,0,"","Serviço","Serviço","-","AGETOP",81504,"SOLUCAO LIMPADORA 1000 CM3","Un    ",1,null,null,0,""]
[4,4,4,2,1,7,2,8,0,2,{"$error":"#N/A"},"","Nível 4","Nível 4","-","SINAPI",null,"CURVAS","-",null,null,null,0,""]
["S",4,"S",0,1,7,2,8,0,0,0,"","Serviço","Serviço","-","SINAPI",89410,"CURVA 90 GRAUS, PVC, SOLDÁVEL, DN 25MM, INSTALADO EM RAMAL DE DISTRIBUIÇÃO DE ÁGUA - FORNECIMENTO E INSTALAÇÃO. AF_12/2014","UN",1,null,null,0,""]
[3,3,3,18,1,7,3,0,0,20,18,"","Nível 3","Nível 3","-","SINAPI",null,"ESGOTO SANITÁRIO","-",null,null,null,0,""]
[4,4,4,4,1,7,3,1,0,17,4,"","Nível 4","Nível 4","-","SINAPI",null,"CORPO DE CAIXA SIFONADA / RALO","-",null,null,null,0,""]
[{"$f":"CHOOSE(1+LOG(1+2*(ORÇAMENTO.Nivel=\"Nível 1\")+4*(ORÇAMENTO.Nivel=\"Nível 2\")+8*(ORÇAMENTO.Nivel=\"Nível 3\")+16*(ORÇAMENTO.Nivel=\"Nível 4\")+32*(ORÇAMENTO.Nivel=\"Serviço\"),2),0,1,2,3,4,\"S\")","v":"S"},4,"S",0,1,7,3,1,0,0,0,"","Serviço","Serviço","-","AGETOP",81681,"CORPO RALO SECO CILINDRICO 100 X 40","Un    ",1,null,null,0,""]
["S",4,"S",0,1,7,3,1,0,0,0,"","Serviço","Serviço","-","AGETOP",81695,"PROLONGAMENTO PARA CAIXA SIFONADA 100 MM","M     ",1,null,null,0,""]
["S",4,"S",0,1,7,3,1,0,0,0,"","Serviço","Serviço","-","AGETOP",81790,"GRELHA REDONDA BRANCA DIAM. 100 MM","Un    ",1,null,null,0,""]
[4,4,4,2,1,7,3,2,0,13,2,"","Nível 4","Nível 4","-","SINAPI",null,"CURVAS","-",null,null,null,0,""]
["S",4,"S",0,1,7,3,2,0,0,0,"","Serviço","Serviço","-","SINAPI",89748,"CURVA CURTA 90 GRAUS, PVC, SERIE NORMAL, ESGOTO PREDIAL, DN 100 MM, JUNTA ELÁSTICA, FORNECIDO E INSTALADO EM RAMAL DE DESCARGA OU RAMAL DE ESGOTO SANITÁRIO. AF_12/2014","UN",1,null,null,0,""]
[4,4,4,4,1,7,3,3,0,11,4,"","Nível 4","Nível 4","-","SINAPI",null,"JOELHOS","-",null,null,null,0,""]
["S",4,"S",0,1,7,3,3,0,0,0,"","Serviço","Serviço","-","SINAPI",89726,"JOELHO 45 GRAUS, PVC, SERIE NORMAL, ESGOTO PREDIAL, DN 40 MM, JUNTA SOLDÁVEL, FORNECIDO E INSTALADO EM RAMAL DE DESCARGA OU RAMAL DE ESGOTO SANITÁRIO. AF_12/2014","UN",2,null,null,0,""]
["S",4,"S",0,1,7,3,3,0,0,0,"","Serviço","Serviço","-","AGETOP",81927,"JOELHO 90 GRAUS C/ANEL 40 mm ","Un    ",2,null,null,0,""]
["S",{"$f":"IF(OR(C168=\"s\",C168=0),OFFSET(B168,-1,0),C168)","v":4},{"$f":"IF(OFFSET(C168,-1,0)=\"L\",1,IF(OFFSET(C168,-1,0)=1,2,IF(OR(A168=\"s\",A168=0),\"S\",IF(AND(OFFSET(C168,-1,0)=2,A168=4),3,IF(AND(OR(OFFSET(C168,-1,0)=\"s\",OFFSET(C168,-1,0)=0),A168<>\"s\",A168>OFFSET(B168,-1,0)),OFFSET(B168,-1,0),A168)))))","v":"S"},{"$f":"IF(OR(C168=\"S\",C168=0),0,IF(ISERROR(K168),J168,SMALL(J168:K168,1)))","v":0},{"$f":"IF($C168=1,OFFSET(E168,-1,0)+1,OFFSET(E168,-1,0))","v":1},{"$f":"IF($C168=1,0,IF($C168=2,OFFSET(F168,-1,0)+1,OFFSET(F168,-1,0)))","v":7},{"$f":"IF(AND($C168<=2,$C168<>0),0,IF($C168=3,OFFSET(G168,-1,0)+1,OFFSET(G168,-1,0)))","v":3},{"$f":"IF(AND($C168<=3,$C168<>0),0,IF($C168=4,OFFSET(H168,-1,0)+1,OFFSET(H168,-1,0)))","v":3},{"$f":"IF(AND($C168<=4,$C168<>0),0,IF(AND($C168=\"S\",$W168>0),OFFSET(I168,-1,0)+1,OFFSET(I168,-1,0)))","v":0},0,0,"","Serviço","Serviço","-","AGETOP",81938,"JOELHO 90 GRAUS DIAMETRO 100 MM","Un    ",1,null,null,0,""]
[4,4,4,2,1,7,3,4,0,7,2,"","Nível 4","Nível 4","-","SINAPI",null,"JUNÇÕES","-",null,null,null,0,""]
["S",4,"S",0,1,7,3,4,0,0,0,"","Serviço","Serviço","-","SINAPI",89834,"JUNÇÃO SIMPLES, PVC, SERIE NORMAL, ESGOTO PREDIAL, DN 100 X 100 MM, JUNTA ELÁSTICA, FORNECIDO E INSTALADO EM PRUMADA DE ESGOTO SANITÁRIO OU VENTILAÇÃO. AF_12/2014","UN",1,null,null,0,"Referência: AGETOP - 81975"]
[4,4,4,2,1,7,3,5,0,5,2,"","Nível 4","Nível 4","-","SINAPI",null,"LUVAS","-",null,null,null,0,""]
["S",4,"S",0,1,7,3,5,0,0,0,"","Serviço","Serviço","-","SINAPI",89778,"LUVA SIMPLES, PVC, SERIE NORMAL, ESGOTO PREDIAL, DN 100 MM, JUNTA ELÁSTICA, FORNECIDO E INSTALADO EM RAMAL DE DESCARGA OU RAMAL DE ESGOTO SANITÁRIO. AF_12/2014","UN",1,null,null,0,"Referência: AGETOP - 82004"]
[4,4,4,3,1,7,3,6,0,3,{"$error":"#N/A"},"","Nível 4","Nível 4","-","SINAPI",null,"TUBOS","-",null,null,null,0,""]
["S",4,"S",0,1,7,3,6,0,0,0,"","Serviço","Serviço","-","SINAPI",89711,"TUBO PVC, SERIE NORMAL, ESGOTO PREDIAL, DN 40 MM, FORNECIDO E INSTALADO EM RAMAL DE DESCARGA OU RAMAL DE ESGOTO SANITÁRIO. AF_12/2014","M",6,null,null,0,"Referência: AGETOP - 82301"]
["S",4,"S",0,1,7,3,6,0,0,0,"","Serviço","Serviço","-","SINAPI",89800,"TUBO PVC, SERIE NORMAL, ESGOTO PREDIAL, DN 100 MM, FORNECIDO E INSTALADO EM PRUMADA DE ESGOTO SANITÁRIO OU VENTILAÇÃO. AF_12/2014","M",6,null,null,0,""]
[3,3,3,2,1,7,4,0,0,2,{"$error":"#N/A"},"","Nível 3","Nível 3","-","SINAPI",null,"OUTROS","-",null,null,null,0,""]
["S",3,"S",0,1,7,4,0,0,0,0,"","Serviço","Serviço","-","AGETOP",81829,"CAIXA DE INSPEÇÃO - TAMPA EM CONCRETO ARMADO 25 MPA E=5CM ","m2    ",1,null,null,0,""]
[2,2,2,37,1,8,0,0,0,141,37,"","Nível 2","Nível 2","-","AGETOP",null,"INSTALAÇÕES ESPECIAIS","-",null,null,null,0,""]
[3,3,3,29,1,8,1,0,0,{"$f":"IF(OR($C179=\"S\",$C179=0),0,MATCH(0,OFFSET($D179,1,$C179,ROW($C$319)-ROW($C179)),0))","v":36},{"$f":"IF(OR($C179=\"S\",$C179=0),0,MATCH(OFFSET($D179,0,$C179)+1,OFFSET($D179,1,$C179,ROW($C$319)-ROW($C179)),0))","v":29},"","Nível 3","Nível 3","-","SINAPI",null,"CENTRAL DE GÁS","-",null,null,null,0,""]
["S",3,"S",0,1,8,1,0,0,0,0,"","Serviço","Serviço","-","AGETOP",91007,"CENTRAL DE GÁS PADRÃO GOINFRA SEM INSTALAÇÕES (1+1 CILINDRO 45 KG)","Un    ",1,null,null,0,""]
["S",3,"S",0,1,8,1,0,0,0,0,"","Serviço","Serviço","-","AGETOP",91023,"UNIÃO S/BRONZE PRETA 3/4\" NPT 300 LBS","Un    ",3,null,null,0,""]
["S",3,"S",0,1,8,1,0,0,0,0,"","Serviço","Serviço","-","COMPOSIÇÃO","COMP 382_SEE","TE DE REDUCAO DE FERRO GALVANIZADO, COM ROSCA BSP, DE 3/4\" X 1/2\"","UN ",1,null,null,0,""]
["S",3,"S",0,1,8,1,0,0,0,0,"","Serviço","Serviço","-","COMPOSIÇÃO","COMP 383_SEE","BUCHA DE REDUCAO DE FERRO GALVANIZADO, COM ROSCA BSP, DE 1/2\" X 1/4\"","UN ",3,null,null,0,""]
["S",3,"S",0,1,8,1,0,0,0,0,"","Serviço","Serviço","-","AGETOP",91021,"LUVA GALVANIZADO DE REDUÇÃO 3/4\" X 1/2\" (GÁS)","Un    ",2,null,null,0,""]
["S",3,"S",0,1,8,1,0,0,0,0,"","Serviço","Serviço","-","SINAPI",92692,"NIPLE, EM FERRO GALVANIZADO, CONEXÃO ROSQUEADA, DN 15 (1/2\"), INSTALADO EM RAMAIS E SUB-RAMAIS DE GÁS - FORNECIMENTO E INSTALAÇÃO. AF_12/2015","UN",6,null,null,0,""]
["S",3,"S",0,1,8,1,0,0,0,0,"","Serviço","Serviço","-","AGETOP",91031,"NIPLE DUPLO 300 PSI 3/4\"","Un    ",6,null,null,0,""]
["S",3,"S",0,1,8,1,0,0,0,0,"","Serviço","Serviço","-","COMPOSIÇÃO","COMP 212_SEE","NIPLE DE REDUÇÃO 1/2\" X 1/4\" BSP","UN ",4,null,null,0,""]
["S",3,"S",0,1,8,1,0,0,0,0,"","Serviço","Serviço","-","COMPOSIÇÃO","COMP 213_SEE","NIPLE DE REDUÇÃO 3/4\" X 1/2\" BSP","UN ",4,null,null,0,""]
["S",3,"S",0,1,8,1,0,0,0,0,"","Serviço","Serviço","-","SINAPI",92688,"TUBO DE AÇO GALVANIZADO COM COSTURA, CLASSE MÉDIA, CONEXÃO ROSQUEADA, DN 20 (3/4\"), INSTALADO EM RAMAIS E SUB-RAMAIS DE GÁS - FORNECIMENTO E INSTALAÇÃO. AF_12/2015","M",24,null,null,0,""]
["S",3,"S",0,1,8,1,0,0,0,0,"","Serviço","Serviço","-","SINAPI",92701,"JOELHO 90 GRAUS, EM FERRO GALVANIZADO, CONEXÃO ROSQUEADA, DN 20 (3/4\"), INSTALADO EM RAMAIS E SUB-RAMAIS DE GÁS - FORNECIMENTO E INSTALAÇÃO. AF_12/2015","UN",8,null,null,0,""]
["S",3,"S",0,1,8,1,0,0,0,0,"","Serviço","Serviço","-","COMPOSIÇÃO","COMP 237_SEE","FITA ANTICORROSIVA","M",10,null,null,0,""]
["S",3,"S",0,1,8,1,0,0,0,0,"","Serviço","Serviço","-","AGETOP",91025,"VÁLVULA ESFERICA LATÃO 3/4\"","Un    ",3,null,null,0,""]
["S",3,"S",0,1,8,1,0,0,0,0,"","Serviço","Serviço","-","AGETOP",91019,"TE PRETO 90º 3/4\" NPT 300 LBS","Un    ",2,null,null,0,""]
["S",3,"S",0,1,8,1,0,0,0,0,"","Serviço","Serviço","-","COMPOSIÇÃO","COMP 542_SEE","VÁLVULA UGV 3/4\" (S) LATÃO","UN ",2,null,null,0,""]
["S",3,"S",0,1,8,1,0,0,0,0,"","Serviço","Serviço","-","COMPOSIÇÃO","COMP 543_SEE","VÁLVULA UGV 1/2\" (S) LATÃO","UN ",2,null,null,0,""]
["S",3,"S",0,1,8,1,0,0,0,0,"","Serviço","Serviço","-","AGETOP",91029,"VALVULA DE RETENÇÃO LATÃO 1/2\" X 7/16\" NPT","Un    ",2,null,null,0,""]
["S",3,"S",0,1,8,1,0,0,0,0,"","Serviço","Serviço","-","COMPOSIÇÃO","COMP 211_SEE","REGULADOR DE 2º ESTÁGIO 5KG/H","UN ",2,null,null,0,""]
["S",3,"S",0,1,8,1,0,0,0,0,"","Serviço","Serviço","-","COMPOSIÇÃO","COMP 210_SEE","REGULADOR DE 1º ESTÁGIO 60KG/H MODELO AP-40  COM MANÔMETRO","UN ",1,null,null,0,""]
["S",3,"S",0,1,8,1,0,0,0,0,"","Serviço","Serviço","-","AGETOP",85003,"EXTINTOR PO QUIMICO SECO (6 KG) - CAPACIDADE EXTINTORA 20 BC","Un    ",1,null,null,0,""]
["S",3,"S",0,1,8,1,0,0,0,0,"","Serviço","Serviço","-","COMPOSIÇÃO","COMP 235_SEE","PLACA DE SINALIZAÇÃO EM PVC COD 01 - (300X300) PROIBIDO FUMAR","UN ",2,null,null,0,""]
["S",3,"S",0,1,8,1,0,0,0,0,"","Serviço","Serviço","-","COMPOSIÇÃO","COMP 236_SEE","PLACA DE SINALIZAÇÃO EM PVC COD 06 - (300X300) PERIGO INFLAMÁVEL","UN ",2,null,null,0,""]
["S",3,"S",0,1,8,1,0,0,0,0,"","Serviço","Serviço","-","AGETOP",91043,"BRAÇADEIRA METALICA TIPO \"D\" DIAM. 3/4\"","Un    ",7,null,null,0,""]
["S",3,"S",0,1,8,1,0,0,0,0,"","Serviço","Serviço","-","AGETOP",71863,"PARAFUSO P/BUCHA S-10","Un    ",14,null,null,0,""]
["S",3,"S",0,1,8,1,0,0,0,0,"","Serviço","Serviço","-","AGETOP",70393,"BUCHA DE NYLON S-10","Un    ",14,null,null,0,""]
["S",3,"S",0,1,8,1,0,0,0,0,"","Serviço","Serviço","-","AGETOP",91045,"SUPORTE PARA COLETOR","Un    ",2,null,null,0,""]
["S",3,"S",0,1,8,1,0,0,0,0,"","Serviço","Serviço","-","COMPOSIÇÃO","COMP 045_SEE","LAUDO DE ESTANQUEIDADE","UN ",1,null,null,0,""]
["S",3,"S",0,1,8,1,0,0,0,0,"","Serviço","Serviço","-","COMPOSIÇÃO","COMP 277_SEE","MARCAÇÃO NO PISO - 1X1 M PARA EXTINTOR","M2",1,null,null,0,""]
[3,3,3,7,1,8,2,0,0,7,32,"","Nível 3","Nível 3","-","AGETOP",null,"PREVENÇÃO E COMBATE A INCÊNDIO","-",null,null,null,0,""]
["S",3,"S",0,1,8,2,0,0,0,0,"","Serviço","Serviço","-","AGETOP",85006,"EXTINTOR MULTI USO EM PO A B C (6 KG) - CAPACIDADE EXTINTORA 3A 20BC","un    ",3,null,null,0,""]
["S",3,"S",0,1,8,2,0,0,0,0,"","Serviço","Serviço","-","COMPOSIÇÃO","COMP 277_SEE","MARCAÇÃO NO PISO - 1X1 M PARA EXTINTOR","M2",3,null,null,0,""]
["S",3,"S",0,1,8,2,0,0,0,0,"","Serviço","Serviço","-","COMPOSIÇÃO","COMP 024_SEE","SINALIZADOR FOTOLUMINESCENTE PARA EXTINTOR","UN ",3,null,null,0,""]
["S",3,"S",0,1,8,2,0,0,0,0,"","Serviço","Serviço","-","COMPOSIÇÃO","COMP 033_SEE","LUMINÁRIA DE EMERGÊNCIA LED PORTÁTIL - 30 LEDS","UN ",8,null,null,0,""]
["S",3,"S",0,1,8,2,0,0,0,0,"","Serviço","Serviço","-","COMPOSIÇÃO","COMP 411_SEE","PLACA DE SINALIZAÇÃO EM PVC COD 13 - (316X158) SAÍDA DE EMERGÊNCIA","UN ",9,null,null,0,""]
["S",3,"S",0,1,8,2,0,0,0,0,"","Serviço","Serviço","-","COMPOSIÇÃO","COMP 412_SEE","PLACA DE SINALIZAÇÃO EM PVC COD 17 - (316X158) MENSAGEM \"SAÍDA\"","UN ",2,null,null,0,""]
[2,2,2,5,1,9,0,0,0,104,5,"","Nível 2","Nível 2","-","AGETOP",null,"ALVENARIAS E DIVISÓRIAS","-",null,null,null,0,""]
[3,3,3,2,1,9,1,0,0,4,2,"","Nível 3","Nível 3","-","AGETOP",null,"AMPLIAÇÃO DA ÁREA DE SERVIÇOS","-",null,null,null,0,""]
["S",3,"S",0,1,9,1,0,0,0,0,"","Serviço","Serviço","-","AGETOP",100201,"ALVENARIA DE TIJOLO FURADO 1/2 VEZ - 9 x 19 x 19 - ARG. (1CALH:4ARML+100KG DE CI/M3)","m2    ",29.37,null,null,0,""]
[3,3,3,2,1,9,2,0,0,2,22,"","Nível 3","Nível 3","-","AGETOP",null,"EXECUÇÃO DE DUAS SALAS DE AULA MODELO PRÓPRIO","-",null,null,null,0,""]
["S",3,"S",0,1,9,2,0,0,0,0,"","Serviço","Serviço","-","AGETOP",100201,"ALVENARIA DE TIJOLO FURADO 1/2 VEZ - 9 x 19 x 19 - ARG. (1CALH:4ARML+100KG DE CI/M3)","m2    ",93.03,null,null,0,""]
[2,2,2,3,1,10,0,0,0,99,3,"","Nível 2","Nível 2","-","AGETOP",null,"IMPERMEABILIZAÇÃO","-",null,null,null,0,""]
[3,3,3,2,1,10,1,0,0,2,10,"","Nível 3","Nível 3","-","AGETOP",null,"VIGAS BALDRAMES","-",null,null,null,0,""]
["S",3,"S",0,1,10,1,0,0,0,0,"","Serviço","Serviço","-","AGETOP",120902,"IMPERMEABILIZACAO VIGAS BALDRAMES E=2,0 CM","m2    ",37.78,null,null,0,""]
[2,2,2,2,1,11,0,0,0,96,2,"","Nível 2","Nível 2","-","AGETOP",null,"ESTRUTURAS METÁLICAS","-",null,null,null,0,""]
["S",2,"S",0,1,11,0,0,0,0,0,"","Serviço","Serviço","-","AGETOP",150204,"ESTRUTURA METÁLICA CONVENCIONAL EM AÇO DO TIPO MR-250 / ASTM A36 COM FUNDO ANTICORROSIVO","Kg    ",356.08,null,null,0,""]
[2,2,2,9,1,12,0,0,0,94,9,"","Nível 2","Nível 2","-","AGETOP",null,"COBERTURAS","-",null,null,null,0,""]
[3,3,3,5,1,12,1,0,0,8,5,"","Nível 3","Nível 3","-","AGETOP",null,"AMPLIAÇÃO DA ÁREA DE SERVIÇOS","-",null,null,null,0,""]
["S",3,"S",0,1,12,1,0,0,0,0,"","Serviço","Serviço","-","AGETOP",160501,"COBERTURA COM TELHA ONDULADA OU EQUIV.","m2    ",5.67,null,null,0,""]
["S",3,"S",0,1,12,1,0,0,0,0,"","Serviço","Serviço","-","SINAPI",94445,"TELHAMENTO COM TELHA CERÂMICA CAPA-CANAL, TIPO PLAN, COM ATÉ 2 ÁGUAS, INCLUSO TRANSPORTE VERTICAL. AF_07/2019","M2",2.59,null,null,0,"Referência: AGETOP - 160401"]
["S",3,"S",0,1,12,1,0,0,0,0,"","Serviço","Serviço","-","AGETOP",160601,"CALHA DE CHAPA GALVANIZADA","m     ",6,null,null,0,""]
["S",3,"S",0,1,12,1,0,0,0,0,"","Serviço","Serviço","-","AGETOP",160602,"RUFO DE CHAPA GALVANIZADA","m     ",9.1,null,null,0,""]
[3,3,3,3,1,12,2,0,0,3,9,"","Nível 3","Nível 3","-","AGETOP",null,"EXECUÇÃO DE DUAS SALAS DE AULA MODELO PRÓPRIO","-",null,null,null,0,""]
["S",3,"S",0,1,12,2,0,0,0,0,"","Serviço","Serviço","-","COMPOSIÇÃO","COMP 338_SEE","TELHA GALVALUME AÇO 0,43 COM ISOPOR DE 30 MM ACABAMENTO EM TELHA PREPINTADA NA COR BRANCA OU ACABAMENTO AÇO LIZO PRE PINTADO BRANCO ","M2",40.85,null,null,0,""]
["S",3,"S",0,1,12,2,0,0,0,0,"","Serviço","Serviço","-","AGETOP",160600,"CALHA DE CHAPA GALVANIZADA","m2    ",5.55,null,null,0,""]
[2,2,2,12,1,13,0,0,0,85,12,"","Nível 2","Nível 2","-","AGETOP",null,"ESQUADRIAS METÁLICAS","-",null,null,null,0,""]
[3,3,3,2,1,13,1,0,0,11,2,"","Nível 3","Nível 3","-","SINAPI",null,"ADEQUAÇÕES DE ACESSIBILIDADE","-",null,null,null,0,""]
[{"$f":"CHOOSE(1+LOG(1+2*(ORÇAMENTO.Nivel=\"Nível 1\")+4*(ORÇAMENTO.Nivel=\"Nível 2\")+8*(ORÇAMENTO.Nivel=\"Nível 3\")+16*(ORÇAMENTO.Nivel=\"Nível 4\")+32*(ORÇAMENTO.Nivel=\"Serviço\"),2),0,1,2,3,4,\"S\")","v":"S"},{"$f":"IF(OR(C236=\"s\",C236=0),OFFSET(B236,-1,0),C236)","v":3},{"$f":"IF(OFFSET(C236,-1,0)=\"L\",1,IF(OFFSET(C236,-1,0)=1,2,IF(OR(A236=\"s\",A236=0),\"S\",IF(AND(OFFSET(C236,-1,0)=2,A236=4),3,IF(AND(OR(OFFSET(C236,-1,0)=\"s\",OFFSET(C236,-1,0)=0),A236<>\"s\",A236>OFFSET(B236,-1,0)),OFFSET(B236,-1,0),A236)))))","v":"S"},{"$f":"IF(OR(C236=\"S\",C236=0),0,IF(ISERROR(K236),J236,SMALL(J236:K236,1)))","v":0},{"$f":"IF($C236=1,OFFSET(E236,-1,0)+1,OFFSET(E236,-1,0))","v":1},{"$f":"IF($C236=1,0,IF($C236=2,OFFSET(F236,-1,0)+1,OFFSET(F236,-1,0)))","v":13},{"$f":"IF(AND($C236<=2,$C236<>0),0,IF($C236=3,OFFSET(G236,-1,0)+1,OFFSET(G236,-1,0)))","v":1},{"$f":"IF(AND($C236<=3,$C236<>0),0,IF($C236=4,OFFSET(H236,-1,0)+1,OFFSET(H236,-1,0)))","v":0},{"$f":"IF(AND($C236<=4,$C236<>0),0,IF(AND($C236=\"S\",$W236>0),OFFSET(I236,-1,0)+1,OFFSET(I236,-1,0)))","v":0},0,0,"","Serviço","Serviço","-","AGETOP",180501,"PORTA DE ABRIR EM CHAPA PF-1 C/FERRAGENS","m2    ",3.78,null,null,0,""]
[3,3,3,3,1,13,2,0,0,9,3,"","Nível 3","Nível 3","-","AGETOP",null,"AMPLIAÇÃO DA ÁREA DE SERVIÇOS","-",null,null,null,0,""]
["S",3,"S",0,1,13,2,0,0,0,0,"","Serviço","Serviço","-","AGETOP",180501,"PORTA DE ABRIR EM CHAPA PF-1 C/FERRAGENS","m2    ",1.47,null,null,0,""]
["S",3,"S",0,1,13,2,0,0,0,0,"","Serviço","Serviço","-","AGETOP",180381,"ESQ. MAXIMO AR CHAPA/VIDRO J3/J5/J6/J8 C/FERRAGENS","m2    ",0.9,null,null,0,""]
[3,3,3,3,1,13,3,0,0,6,3,"","Nível 3","Nível 3","-","AGETOP",null,"EXECUÇÃO DE DUAS SALAS DE AULA MODELO PRÓPRIO","-",null,null,null,0,""]
["S",3,"S",0,1,13,3,0,0,0,0,"","Serviço","Serviço","-","AGETOP",180501,"PORTA DE ABRIR EM CHAPA PF-1 C/FERRAGENS","m2    ",3.36,null,null,0,""]
["S",3,"S",0,1,13,3,0,0,0,0,"","Serviço","Serviço","-","AGETOP",180381,"ESQ. MAXIMO AR CHAPA/VIDRO J3/J5/J6/J8 C/FERRAGENS","m2    ",4.5,null,null,0,""]
[3,3,3,3,1,13,4,0,0,{"$f":"IF(OR($C243=\"S\",$C243=0),0,MATCH(0,OFFSET($D243,1,$C243,ROW($C$319)-ROW($C243)),0))","v":3},{"$f":"IF(OR($C243=\"S\",$C243=0),0,MATCH(OFFSET($D243,0,$C243)+1,OFFSET($D243,1,$C243,ROW($C$319)-ROW($C243)),0))","v":{"$error":"#N/A"}},"","Nível 3","Nível 3","-","AGETOP",null,"REFORMA GERAL","-",null,null,null,0,""]
["S",3,"S",0,1,13,4,0,0,0,0,"","Serviço","Serviço","-","AGETOP",180381,"ESQ. MAXIMO AR CHAPA/VIDRO J3/J5/J6/J8 C/FERRAGENS","m2    ",0.75,null,null,0,""]
[{"$f":"CHOOSE(1+LOG(1+2*(ORÇAMENTO.Nivel=\"Nível 1\")+4*(ORÇAMENTO.Nivel=\"Nível 2\")+8*(ORÇAMENTO.Nivel=\"Nível 3\")+16*(ORÇAMENTO.Nivel=\"Nível 4\")+32*(ORÇAMENTO.Nivel=\"Serviço\"),2),0,1,2,3,4,\"S\")","v":"S"},{"$f":"IF(OR(C245=\"s\",C245=0),OFFSET(B245,-1,0),C245)","v":3},{"$f":"IF(OFFSET(C245,-1,0)=\"L\",1,IF(OFFSET(C245,-1,0)=1,2,IF(OR(A245=\"s\",A245=0),\"S\",IF(AND(OFFSET(C245,-1,0)=2,A245=4),3,IF(AND(OR(OFFSET(C245,-1,0)=\"s\",OFFSET(C245,-1,0)=0),A245<>\"s\",A245>OFFSET(B245,-1,0)),OFFSET(B245,-1,0),A245)))))","v":"S"},{"$f":"IF(OR(C245=\"S\",C245=0),0,IF(ISERROR(K245),J245,SMALL(J245:K245,1)))","v":0},{"$f":"IF($C245=1,OFFSET(E245,-1,0)+1,OFFSET(E245,-1,0))","v":1},{"$f":"IF($C245=1,0,IF($C245=2,OFFSET(F245,-1,0)+1,OFFSET(F245,-1,0)))","v":13},{"$f":"IF(AND($C245<=2,$C245<>0),0,IF($C245=3,OFFSET(G245,-1,0)+1,OFFSET(G245,-1,0)))","v":4},{"$f":"IF(AND($C245<=3,$C245<>0),0,IF($C245=4,OFFSET(H245,-1,0)+1,OFFSET(H245,-1,0)))","v":0},{"$f":"IF(AND($C245<=4,$C245<>0),0,IF(AND($C245=\"S\",$W245>0),OFFSET(I245,-1,0)+1,OFFSET(I245,-1,0)))","v":0},0,0,"","Serviço","Serviço","-","AGETOP",180501,"PORTA DE ABRIR EM CHAPA PF-1 C/FERRAGENS","m2    ",3.78,null,null,0,""]
[2,2,2,7,1,14,0,0,0,73,7,"","Nível 2","Nível 2","-","AGETOP",null,"VIDROS","-",null,null,null,0,""]
[3,3,3,2,1,14,1,0,0,6,2,"","Nível 3","Nível 3","-","AGETOP",null,"AMPLIAÇÃO DA ÁREA DE SERVIÇOS","-",null,null,null,0,""]
["S",3,"S",0,1,14,1,0,0,0,0,"","Serviço","Serviço","-","AGETOP",190102,"VIDRO LISO 4 MM - COLOCADO","m2    ",0.9,null,null,0,""]
[3,3,3,2,1,14,2,0,0,4,2,"","Nível 3","Nível 3","-","AGETOP",null,"EXECUÇÃO DE DUAS SALAS DE AULA MODELO PRÓPRIO","-",null,null,null,0,""]
["S",3,"S",0,1,14,2,0,0,0,0,"","Serviço","Serviço","-","AGETOP",190201,"VIDRO TEMPERADO 10 MM  - COLOCADO","m2    ",4.5,null,null,0,""]
[3,3,3,2,1,14,3,0,0,2,30,"","Nível 3","Nível 3","-","AGETOP",null,"REFORMA GERAL","-",null,null,null,0,""]
["S",3,"S",0,1,14,3,0,0,0,0,"","Serviço","Serviço","-","AGETOP",190102,"VIDRO LISO 4 MM - COLOCADO","m2    ",0.75,null,null,0,""]
[2,2,2,11,1,15,0,0,0,66,11,"","Nível 2","Nível 2","-","AGETOP",null,"REVESTIMENTO DE PAREDE","-",null,null,null,0,""]
[3,3,3,5,1,15,1,0,0,10,5,"","Nível 3","Nível 3","-","AGETOP",null,"AMPLIAÇÃO DA ÁREA DE SERVIÇOS","-",null,null,null,0,""]
["S",3,"S",0,1,15,1,0,0,0,0,"","Serviço","Serviço","-","AGETOP",200101,"CHAPISCO COMUM","m2    ",65.88,null,null,0,""]
[{"$f":"CHOOSE(1+LOG(1+2*(ORÇAMENTO.Nivel=\"Nível 1\")+4*(ORÇAMENTO.Nivel=\"Nível 2\")+8*(ORÇAMENTO.Nivel=\"Nível 3\")+16*(ORÇAMENTO.Nivel=\"Nível 4\")+32*(ORÇAMENTO.Nivel=\"Serviço\"),2),0,1,2,3,4,\"S\")","v":"S"},3,"S",0,1,15,1,0,0,0,0,"","Serviço","Serviço","-","AGETOP",200201,"EMBOÇO (1CI:4 ARML)","m2    ",31.16,null,null,0,""]
["S",3,"S",0,1,15,1,0,0,0,0,"","Serviço","Serviço","-","AGETOP",200499,"REBOCO PAULISTA A-14 (1CALH:4ARMLC+100kgCI/M3)","m2    ",34.72,null,null,0,""]
["S",3,"S",0,1,15,1,0,0,0,0,"","Serviço","Serviço","-","AGETOP",201302,"REVESTIMENTO COM CERÂMICA ","m2    ",31.16,null,null,0,""]
[3,3,3,3,1,15,2,0,0,5,3,"","Nível 3","Nível 3","-","AGETOP",null,"EXECUÇÃO DE DUAS SALAS DE AULA MODELO PRÓPRIO","-",null,null,null,0,""]
["S",3,"S",0,1,15,2,0,0,0,0,"","Serviço","Serviço","-","AGETOP",200101,"CHAPISCO COMUM","m2    ",208.46,null,null,0,""]
["S",3,"S",0,1,15,2,0,0,0,0,"","Serviço","Serviço","-","AGETOP",200499,"REBOCO PAULISTA A-14 (1CALH:4ARMLC+100kgCI/M3)","m2    ",208.46,null,null,0,""]
[3,3,3,2,1,15,3,0,0,2,19,"","Nível 3","Nível 3","-","AGETOP",null,"REFORMA GERAL","-",null,null,null,0,""]
["S",3,"S",0,1,15,3,0,0,0,0,"","Serviço","Serviço","-","AGETOP",200499,"REBOCO PAULISTA A-14 (1CALH:4ARMLC+100kgCI/M3)","m2    ",116.45,null,null,0,""]
[2,{"$f":"IF(OR(C264=\"s\",C264=0),OFFSET(B264,-1,0),C264)","v":2},{"$f":"IF(OFFSET(C264,-1,0)=\"L\",1,IF(OFFSET(C264,-1,0)=1,2,IF(OR(A264=\"s\",A264=0),\"S\",IF(AND(OFFSET(C264,-1,0)=2,A264=4),3,IF(AND(OR(OFFSET(C264,-1,0)=\"s\",OFFSET(C264,-1,0)=0),A264<>\"s\",A264>OFFSET(B264,-1,0)),OFFSET(B264,-1,0),A264)))))","v":2},{"$f":"IF(OR(C264=\"S\",C264=0),0,IF(ISERROR(K264),J264,SMALL(J264:K264,1)))","v":5},{"$f":"IF($C264=1,OFFSET(E264,-1,0)+1,OFFSET(E264,-1,0))","v":1},{"$f":"IF($C264=1,0,IF($C264=2,OFFSET(F264,-1,0)+1,OFFSET(F264,-1,0)))","v":16},{"$f":"IF(AND($C264<=2,$C264<>0),0,IF($C264=3,OFFSET(G264,-1,0)+1,OFFSET(G264,-1,0)))","v":0},{"$f":"IF(AND($C264<=3,$C264<>0),0,IF($C264=4,OFFSET(H264,-1,0)+1,OFFSET(H264,-1,0)))","v":0},{"$f":"IF(AND($C264<=4,$C264<>0),0,IF(AND($C264=\"S\",$W264>0),OFFSET(I264,-1,0)+1,OFFSET(I264,-1,0)))","v":0},55,5,"","Nível 2","Nível 2","-","AGETOP",null,"FORROS","-",null,null,null,0,""]
[3,3,3,2,1,16,1,0,0,4,2,"","Nível 3","Nível 3","-","AGETOP",null,"AMPLIAÇÃO DA ÁREA DE SERVIÇOS","-",null,null,null,0,""]
["S",3,"S",0,1,16,1,0,0,0,0,"","Serviço","Serviço","-","AGETOP",210498,"FORRO DE GESSO ACARTONADO PARA ÁREAS SECAS ESPESSURA DE 12,5MM","m2    ",9.6,null,null,0,""]
[3,3,3,2,1,16,2,0,0,2,10,"","Nível 3","Nível 3","-","AGETOP",null,"EXECUÇÃO DE DUAS SALAS DE AULA MODELO PRÓPRIO","-",null,null,null,0,""]
["S",3,"S",0,1,16,2,0,0,0,0,"","Serviço","Serviço","-","AGETOP",210498,"FORRO DE GESSO ACARTONADO PARA ÁREAS SECAS ESPESSURA DE 12,5MM","m2    ",34.04,null,null,0,""]
[2,2,2,14,1,17,0,0,0,50,14,"","Nível 2","Nível 2","-","AGETOP",null,"REVESTIMENTO DE PISO","-",null,null,null,0,""]
[3,3,3,3,1,17,1,0,0,13,3,"","Nível 3","Nível 3","-","SINAPI",null,"ADEQUAÇÕES DE ACESSIBILIDADE","-",null,null,null,0,""]
["S",3,"S",0,1,17,1,0,0,0,0,"","Serviço","Serviço","-","AGETOP",221126,"PISO DE LADRILHO HIDRÁULICO COLORIDO MODELO TÁTIL ( ALERTA OU DIRECIONAL) SEM LASTRO","m2    ",22.68,null,null,0,""]
["S",3,"S",0,1,17,1,0,0,0,0,"","Serviço","Serviço","-","AGETOP",220102,"PISO CONCRETO DESEMPENADO ESPESSURA = 5 CM  1:2,5:3,5","m2    ",2.9,null,null,0,""]
[3,3,3,4,1,17,2,0,0,10,4,"","Nível 3","Nível 3","-","AGETOP",null,"AMPLIAÇÃO DA ÁREA DE SERVIÇOS","-",null,null,null,0,""]
["S",3,"S",0,1,17,2,0,0,0,0,"","Serviço","Serviço","-","AGETOP",220104,"PISO EM CONCRETO DESEMPENADO ESPESSURA = 7 CM  1:2,5:3,5","m2    ",31.93,null,null,0,""]
["S",3,"S",0,1,17,2,0,0,0,0,"","Serviço","Serviço","-","AGETOP",221101,"GRANITINA 8MM FUNDIDA COM CONTRAPISO (1CI:3ARML) E=2CM E JUNTA PLASTICA 27MM","m2    ",10.9,null,null,0,""]
["S",3,"S",0,1,17,2,0,0,0,0,"","Serviço","Serviço","-","AGETOP",221104,"RASPAGEM E APLICAÇÃO RESINA ACRÍLICA DUAS DEMÃOS","m2    ",10.9,null,null,0,""]
[3,3,3,4,1,17,3,0,0,6,4,"","Nível 3","Nível 3","-","AGETOP",null,"EXECUÇÃO DE DUAS SALAS DE AULA MODELO PRÓPRIO","-",null,null,null,0,""]
["S",3,"S",0,1,17,3,0,0,0,0,"","Serviço","Serviço","-","AGETOP",221101,"GRANITINA 8MM FUNDIDA COM CONTRAPISO (1CI:3ARML) E=2CM E JUNTA PLASTICA 27MM","m2    ",34.04,null,null,0,""]
["S",3,"S",0,1,17,3,0,0,0,0,"","Serviço","Serviço","-","AGETOP",221102,"RODAPÉ FUNDIDO DE GRANITINA 7CM","m     ",31.5,null,null,0,""]
["S",3,"S",0,1,17,3,0,0,0,0,"","Serviço","Serviço","-","AGETOP",221104,"RASPAGEM E APLICAÇÃO RESINA ACRÍLICA DUAS DEMÃOS","m2    ",36.25,null,null,0,""]
[3,3,3,2,1,17,4,0,0,{"$f":"IF(OR($C281=\"S\",$C281=0),0,MATCH(0,OFFSET($D281,1,$C281,ROW($C$319)-ROW($C281)),0))","v":2},{"$f":"IF(OR($C281=\"S\",$C281=0),0,MATCH(OFFSET($D281,0,$C281)+1,OFFSET($D281,1,$C281,ROW($C$319)-ROW($C281)),0))","v":{"$error":"#N/A"}},"","Nível 3","Nível 3","-","SINAPI",null,"CENTRAL DE GÁS","-",null,null,null,0,""]
["S",3,"S",0,1,17,4,0,0,0,0,"","Serviço","Serviço","-","AGETOP",220102,"PISO CONCRETO DESEMPENADO ESPESSURA = 5 CM  1:2,5:3,5","m2    ",1.97,null,null,0,""]
[2,2,2,3,1,18,0,0,0,{"$f":"IF(OR($C283=\"S\",$C283=0),0,MATCH(0,OFFSET($D283,1,$C283,ROW($C$319)-ROW($C283)),0))","v":36},{"$f":"IF(OR($C283=\"S\",$C283=0),0,MATCH(OFFSET($D283,0,$C283)+1,OFFSET($D283,1,$C283,ROW($C$319)-ROW($C283)),0))","v":3},"","Nível 2","Nível 2","-","SINAPI",null,"FERRAGENS","-",null,null,null,0,""]
[3,3,3,2,1,18,1,0,0,2,9,"","Nível 3","Nível 3","-","SINAPI",null,"ADEQUAÇÕES DE ACESSIBILIDADE","-",null,null,null,0,""]
["S",3,"S",0,1,18,1,0,0,0,0,"","Serviço","Serviço","-","AGETOP",230174,"BARRA DE APOIO EM AÇO INOX - 40 CM","un    ",2,null,null,0,""]
[2,2,2,4,1,19,0,0,0,33,4,"","Nível 2","Nível 2","-","AGETOP",null,"ADMINISTRAÇÃO","-",null,null,null,0,""]
[3,3,3,3,1,19,1,0,0,3,6,"","Nível 3","Nível 3","-","AGETOP",null,"MENSALISTAS","-",null,null,null,0,""]
["S",3,"S",0,1,19,1,0,0,0,0,"","Serviço","Serviço","-","AGETOP",250101,"ENGENHEIRO - (OBRAS CIVIS)","H     ",24,null,null,0,""]
["S",3,"S",0,1,19,1,0,0,0,0,"","Serviço","Serviço","-","AGETOP",250103,"ENCARREGADO - (OBRAS CIVIS)","H     ",330,null,null,0,""]
[2,2,2,24,1,20,0,0,0,29,24,"","Nível 2","Nível 2","-","AGETOP",null,"PINTURA","-",null,null,null,0,""]
[3,3,3,2,1,20,1,0,0,23,2,"","Nível 3","Nível 3","-","SINAPI",null,"ACESSIBILIDADE","-",null,null,null,0,""]
["S",3,"S",0,1,20,1,0,0,0,0,"","Serviço","Serviço","-","AGETOP",261602,"PINT.ESMALTE/ESQUAD.FERRO C/FUNDO ANTICOR.","m2    ",11.34,null,null,0,""]
[3,3,3,3,1,20,2,0,0,21,3,"","Nível 3","Nível 3","-","AGETOP",null,"AMPLIAÇÃO DA ÁREA DE SERVIÇOS","-",null,null,null,0,""]
["S",3,"S",0,1,20,2,0,0,0,0,"","Serviço","Serviço","-","AGETOP",261602,"PINT.ESMALTE/ESQUAD.FERRO C/FUNDO ANTICOR.","m2    ",6.21,null,null,0,""]
[{"$f":"CHOOSE(1+LOG(1+2*(ORÇAMENTO.Nivel=\"Nível 1\")+4*(ORÇAMENTO.Nivel=\"Nível 2\")+8*(ORÇAMENTO.Nivel=\"Nível 3\")+16*(ORÇAMENTO.Nivel=\"Nível 4\")+32*(ORÇAMENTO.Nivel=\"Serviço\"),2),0,1,2,3,4,\"S\")","v":"S"},{"$f":"IF(OR(C295=\"s\",C295=0),OFFSET(B295,-1,0),C295)","v":3},{"$f":"IF(OFFSET(C295,-1,0)=\"L\",1,IF(OFFSET(C295,-1,0)=1,2,IF(OR(A295=\"s\",A295=0),\"S\",IF(AND(OFFSET(C295,-1,0)=2,A295=4),3,IF(AND(OR(OFFSET(C295,-1,0)=\"s\",OFFSET(C295,-1,0)=0),A295<>\"s\",A295>OFFSET(B295,-1,0)),OFFSET(B295,-1,0),A295)))))","v":"S"},{"$f":"IF(OR(C295=\"S\",C295=0),0,IF(ISERROR(K295),J295,SMALL(J295:K295,1)))","v":0},{"$f":"IF($C295=1,OFFSET(E295,-1,0)+1,OFFSET(E295,-1,0))","v":1},{"$f":"IF($C295=1,0,IF($C295=2,OFFSET(F295,-1,0)+1,OFFSET(F295,-1,0)))","v":20},{"$f":"IF(AND($C295<=2,$C295<>0),0,IF($C295=3,OFFSET(G295,-1,0)+1,OFFSET(G295,-1,0)))","v":2},{"$f":"IF(AND($C295<=3,$C295<>0),0,IF($C295=4,OFFSET(H295,-1,0)+1,OFFSET(H295,-1,0)))","v":0},{"$f":"IF(AND($C295<=4,$C295<>0),0,IF(AND($C295=\"S\",$W295>0),OFFSET(I295,-1,0)+1,OFFSET(I295,-1,0)))","v":0},0,0,"","Serviço","Serviço","-","AGETOP",261611,"PINTURA  ALQUÍDICA BRILHANTE DUPLA FUNÇÃO 2 DEMÃOS = 50 MÍCRONS","m2    ",8.26,null,null,0,""]
[3,3,3,3,1,20,3,0,0,18,3,"","Nível 3","Nível 3","-","AGETOP",null,"EXECUÇÃO DE DUAS SALAS DE AULA MODELO PRÓPRIO","-",null,null,null,0,""]
["S",3,"S",0,1,20,3,0,0,0,0,"","Serviço","Serviço","-","AGETOP",261602,"PINT.ESMALTE/ESQUAD.FERRO C/FUNDO ANTICOR.","m2    ",19.079999999999998,null,null,0,""]
[{"$f":"CHOOSE(1+LOG(1+2*(ORÇAMENTO.Nivel=\"Nível 1\")+4*(ORÇAMENTO.Nivel=\"Nível 2\")+8*(ORÇAMENTO.Nivel=\"Nível 3\")+16*(ORÇAMENTO.Nivel=\"Nível 4\")+32*(ORÇAMENTO.Nivel=\"Serviço\"),2),0,1,2,3,4,\"S\")","v":"S"},{"$f":"IF(OR(C298=\"s\",C298=0),OFFSET(B298,-1,0),C298)","v":3},{"$f":"IF(OFFSET(C298,-1,0)=\"L\",1,IF(OFFSET(C298,-1,0)=1,2,IF(OR(A298=\"s\",A298=0),\"S\",IF(AND(OFFSET(C298,-1,0)=2,A298=4),3,IF(AND(OR(OFFSET(C298,-1,0)=\"s\",OFFSET(C298,-1,0)=0),A298<>\"s\",A298>OFFSET(B298,-1,0)),OFFSET(B298,-1,0),A298)))))","v":"S"},{"$f":"IF(OR(C298=\"S\",C298=0),0,IF(ISERROR(K298),J298,SMALL(J298:K298,1)))","v":0},{"$f":"IF($C298=1,OFFSET(E298,-1,0)+1,OFFSET(E298,-1,0))","v":1},{"$f":"IF($C298=1,0,IF($C298=2,OFFSET(F298,-1,0)+1,OFFSET(F298,-1,0)))","v":20},{"$f":"IF(AND($C298<=2,$C298<>0),0,IF($C298=3,OFFSET(G298,-1,0)+1,OFFSET(G298,-1,0)))","v":3},{"$f":"IF(AND($C298<=3,$C298<>0),0,IF($C298=4,OFFSET(H298,-1,0)+1,OFFSET(H298,-1,0)))","v":0},{"$f":"IF(AND($C298<=4,$C298<>0),0,IF(AND($C298=\"S\",$W298>0),OFFSET(I298,-1,0)+1,OFFSET(I298,-1,0)))","v":0},0,0,"","Serviço","Serviço","-","AGETOP",261611,"PINTURA  ALQUÍDICA BRILHANTE DUPLA FUNÇÃO 2 DEMÃOS = 50 MÍCRONS","m2    ",40.85,null,null,0,""]
[3,3,3,15,1,20,4,0,0,15,{"$error":"#N/A"},"","Nível 3","Nível 3","-","AGETOP",null,"REFORMA GERAL","-",null,null,null,0,""]
[{"$f":"CHOOSE(1+LOG(1+2*(ORÇAMENTO.Nivel=\"Nível 1\")+4*(ORÇAMENTO.Nivel=\"Nível 2\")+8*(ORÇAMENTO.Nivel=\"Nível 3\")+16*(ORÇAMENTO.Nivel=\"Nível 4\")+32*(ORÇAMENTO.Nivel=\"Serviço\"),2),0,1,2,3,4,\"S\")","v":4},{"$f":"IF(OR(C300=\"s\",C300=0),OFFSET(B300,-1,0),C300)","v":4},{"$f":"IF(OFFSET(C300,-1,0)=\"L\",1,IF(OFFSET(C300,-1,0)=1,2,IF(OR(A300=\"s\",A300=0),\"S\",IF(AND(OFFSET(C300,-1,0)=2,A300=4),3,IF(AND(OR(OFFSET(C300,-1,0)=\"s\",OFFSET(C300,-1,0)=0),A300<>\"s\",A300>OFFSET(B300,-1,0)),OFFSET(B300,-1,0),A300)))))","v":4},{"$f":"IF(OR(C300=\"S\",C300=0),0,IF(ISERROR(K300),J300,SMALL(J300:K300,1)))","v":6},{"$f":"IF($C300=1,OFFSET(E300,-1,0)+1,OFFSET(E300,-1,0))","v":1},{"$f":"IF($C300=1,0,IF($C300=2,OFFSET(F300,-1,0)+1,OFFSET(F300,-1,0)))","v":20},{"$f":"IF(AND($C300<=2,$C300<>0),0,IF($C300=3,OFFSET(G300,-1,0)+1,OFFSET(G300,-1,0)))","v":4},{"$f":"IF(AND($C300<=3,$C300<>0),0,IF($C300=4,OFFSET(H300,-1,0)+1,OFFSET(H300,-1,0)))","v":1},{"$f":"IF(AND($C300<=4,$C300<>0),0,IF(AND($C300=\"S\",$W300>0),OFFSET(I300,-1,0)+1,OFFSET(I300,-1,0)))","v":0},14,6,"","Nível 4","Nível 4","-","SINAPI",null,"PAREDES E FORRO","-",null,null,null,0,""]
["S",4,"S",0,1,20,4,1,0,0,0,"","Serviço","Serviço","-","AGETOP",260104,"REMOCAO DE PINTURA ANTIGA A LATEX","m2    ",20,null,null,0,""]
["S",4,"S",0,1,20,4,1,0,0,0,"","Serviço","Serviço","-","AGETOP",261300,"EMASSAMENTO COM MASSA PVA DUAS DEMAOS","m2    ",179.19,null,null,0,""]
["S",4,"S",0,1,20,4,1,0,0,0,"","Serviço","Serviço","-","AGETOP",261550,"PINT.ESMALTE SINT.PAREDES - 2 DEM.C/SELADOR","m2    ",439.58,null,null,0,""]
["S",4,"S",0,1,20,4,1,0,0,0,"","Serviço","Serviço","-","AGETOP",261000,"PINTURA LATEX ACRILICA 2 DEMAOS C/SELADOR","m2    ",916.8,null,null,0,""]
[{"$f":"CHOOSE(1+LOG(1+2*(ORÇAMENTO.Nivel=\"Nível 1\")+4*(ORÇAMENTO.Nivel=\"Nível 2\")+8*(ORÇAMENTO.Nivel=\"Nível 3\")+16*(ORÇAMENTO.Nivel=\"Nível 4\")+32*(ORÇAMENTO.Nivel=\"Serviço\"),2),0,1,2,3,4,\"S\")","v":"S"},{"$f":"IF(OR(C305=\"s\",C305=0),OFFSET(B305,-1,0),C305)","v":4},{"$f":"IF(OFFSET(C305,-1,0)=\"L\",1,IF(OFFSET(C305,-1,0)=1,2,IF(OR(A305=\"s\",A305=0),\"S\",IF(AND(OFFSET(C305,-1,0)=2,A305=4),3,IF(AND(OR(OFFSET(C305,-1,0)=\"s\",OFFSET(C305,-1,0)=0),A305<>\"s\",A305>OFFSET(B305,-1,0)),OFFSET(B305,-1,0),A305)))))","v":"S"},{"$f":"IF(OR(C305=\"S\",C305=0),0,IF(ISERROR(K305),J305,SMALL(J305:K305,1)))","v":0},{"$f":"IF($C305=1,OFFSET(E305,-1,0)+1,OFFSET(E305,-1,0))","v":1},{"$f":"IF($C305=1,0,IF($C305=2,OFFSET(F305,-1,0)+1,OFFSET(F305,-1,0)))","v":20},{"$f":"IF(AND($C305<=2,$C305<>0),0,IF($C305=3,OFFSET(G305,-1,0)+1,OFFSET(G305,-1,0)))","v":4},{"$f":"IF(AND($C305<=3,$C305<>0),0,IF($C305=4,OFFSET(H305,-1,0)+1,OFFSET(H305,-1,0)))","v":1},{"$f":"IF(AND($C305<=4,$C305<>0),0,IF(AND($C305=\"S\",$W305>0),OFFSET(I305,-1,0)+1,OFFSET(I305,-1,0)))","v":0},0,0,"","Serviço","Serviço","-","AGETOP",261307,"PINTURA PVA LATEX 2 DEMAOS SEM SELADOR","m2    ",43.64,null,null,0,""]
[{"$f":"CHOOSE(1+LOG(1+2*(ORÇAMENTO.Nivel=\"Nível 1\")+4*(ORÇAMENTO.Nivel=\"Nível 2\")+8*(ORÇAMENTO.Nivel=\"Nível 3\")+16*(ORÇAMENTO.Nivel=\"Nível 4\")+32*(ORÇAMENTO.Nivel=\"Serviço\"),2),0,1,2,3,4,\"S\")","v":4},{"$f":"IF(OR(C306=\"s\",C306=0),OFFSET(B306,-1,0),C306)","v":4},{"$f":"IF(OFFSET(C306,-1,0)=\"L\",1,IF(OFFSET(C306,-1,0)=1,2,IF(OR(A306=\"s\",A306=0),\"S\",IF(AND(OFFSET(C306,-1,0)=2,A306=4),3,IF(AND(OR(OFFSET(C306,-1,0)=\"s\",OFFSET(C306,-1,0)=0),A306<>\"s\",A306>OFFSET(B306,-1,0)),OFFSET(B306,-1,0),A306)))))","v":4},{"$f":"IF(OR(C306=\"S\",C306=0),0,IF(ISERROR(K306),J306,SMALL(J306:K306,1)))","v":3},{"$f":"IF($C306=1,OFFSET(E306,-1,0)+1,OFFSET(E306,-1,0))","v":1},{"$f":"IF($C306=1,0,IF($C306=2,OFFSET(F306,-1,0)+1,OFFSET(F306,-1,0)))","v":20},{"$f":"IF(AND($C306<=2,$C306<>0),0,IF($C306=3,OFFSET(G306,-1,0)+1,OFFSET(G306,-1,0)))","v":4},{"$f":"IF(AND($C306<=3,$C306<>0),0,IF($C306=4,OFFSET(H306,-1,0)+1,OFFSET(H306,-1,0)))","v":2},{"$f":"IF(AND($C306<=4,$C306<>0),0,IF(AND($C306=\"S\",$W306>0),OFFSET(I306,-1,0)+1,OFFSET(I306,-1,0)))","v":0},8,3,"","Nível 4","Nível 4","-","SINAPI",null,"ESQUADRIAS EXISTENTES","-",null,null,null,0,""]
["S",4,"S",0,1,20,4,2,0,0,0,"","Serviço","Serviço","-","AGETOP",260105,"REMOCAO DE PINTURA ANTIGA A OLEO OU ESMALTE","m2    ",266.24,null,null,0,""]
["S",4,"S",0,1,20,4,2,0,0,0,"","Serviço","Serviço","-","AGETOP",261602,"PINT.ESMALTE/ESQUAD.FERRO C/FUNDO ANTICOR.","m2    ",266.24,null,null,0,""]
[4,4,4,2,1,20,4,3,0,{"$f":"IF(OR($C309=\"S\",$C309=0),0,MATCH(0,OFFSET($D309,1,$C309,ROW($C$319)-ROW($C309)),0))","v":5},{"$f":"IF(OR($C309=\"S\",$C309=0),0,MATCH(OFFSET($D309,0,$C309)+1,OFFSET($D309,1,$C309,ROW($C$319)-ROW($C309)),0))","v":2},"","Nível 4","Nível 4","-","SINAPI",null,"ESQUADRIAS NOVAS","-",null,null,null,0,""]
["S",4,"S",0,1,20,4,3,0,0,0,"","Serviço","Serviço","-","AGETOP",261602,"PINT.ESMALTE/ESQUAD.FERRO C/FUNDO ANTICOR.","m2    ",12.84,null,null,0,""]
[4,4,4,3,1,20,4,4,0,{"$f":"IF(OR($C311=\"S\",$C311=0),0,MATCH(0,OFFSET($D311,1,$C311,ROW($C$319)-ROW($C311)),0))","v":3},{"$f":"IF(OR($C311=\"S\",$C311=0),0,MATCH(OFFSET($D311,0,$C311)+1,OFFSET($D311,1,$C311,ROW($C$319)-ROW($C311)),0))","v":{"$error":"#N/A"}},"","Nível 4","Nível 4","-","AGETOP",null,"MURO","-",null,null,null,0,""]
["S",4,"S",0,1,20,4,4,0,0,0,"","Serviço","Serviço","-","AGETOP",261000,"PINTURA LATEX ACRILICA 2 DEMAOS C/SELADOR","m2    ",390,null,null,0,""]
["S",4,"S",0,1,20,4,4,0,0,0,"","Serviço","Serviço","-","AGETOP",261620,"LETREIRO MÉDIO A GRANDE PORTE EM PAREDE FEITO A PINCEL","m2    ",7.2,null,null,0,""]
[2,2,2,5,1,21,0,0,0,5,{"$error":"#N/A"},"","Nível 2","Nível 2","-","AGETOP",null,"DIVERSOS","-",null,null,null,0,""]
[3,3,3,2,1,21,1,0,0,4,2,"","Nível 3","Nível 3","-","AGETOP",null,"EXECUÇÃO DE DUAS SALAS DE AULA MODELO PRÓPRIO","-",null,null,null,0,""]
["S",3,"S",0,1,21,1,0,0,0,0,"","Serviço","Serviço","-","COMPOSIÇÃO","COMP 084_SEE","GUARDA-CORPO COM CORRIMÃO - SEDUC","M",32.590000000000003,null,null,0,""]
[3,{"$f":"IF(OR(C317=\"s\",C317=0),OFFSET(B317,-1,0),C317)","v":3},{"$f":"IF(OFFSET(C317,-1,0)=\"L\",1,IF(OFFSET(C317,-1,0)=1,2,IF(OR(A317=\"s\",A317=0),\"S\",IF(AND(OFFSET(C317,-1,0)=2,A317=4),3,IF(AND(OR(OFFSET(C317,-1,0)=\"s\",OFFSET(C317,-1,0)=0),A317<>\"s\",A317>OFFSET(B317,-1,0)),OFFSET(B317,-1,0),A317)))))","v":3},{"$f":"IF(OR(C317=\"S\",C317=0),0,IF(ISERROR(K317),J317,SMALL(J317:K317,1)))","v":2},{"$f":"IF($C317=1,OFFSET(E317,-1,0)+1,OFFSET(E317,-1,0))","v":1},{"$f":"IF($C317=1,0,IF($C317=2,OFFSET(F317,-1,0)+1,OFFSET(F317,-1,0)))","v":21},{"$f":"IF(AND($C317<=2,$C317<>0),0,IF($C317=3,OFFSET(G317,-1,0)+1,OFFSET(G317,-1,0)))","v":2},{"$f":"IF(AND($C317<=3,$C317<>0),0,IF($C317=4,OFFSET(H317,-1,0)+1,OFFSET(H317,-1,0)))","v":0},{"$f":"IF(AND($C317<=4,$C317<>0),0,IF(AND($C317=\"S\",$W317>0),OFFSET(I317,-1,0)+1,OFFSET(I317,-1,0)))","v":0},{"$f":"IF(OR($C317=\"S\",$C317=0),0,MATCH(0,OFFSET($D317,1,$C317,ROW($C$319)-ROW($C317)),0))","v":2},{"$f":"IF(OR($C317=\"S\",$C317=0),0,MATCH(OFFSET($D317,0,$C317)+1,OFFSET($D317,1,$C317,ROW($C$319)-ROW($C317)),0))","v":{"$error":"#N/A"}},"","Nível 3","Nível 3","-","SINAPI",null,"OUTROS","-",null,null,null,0,""]
["S",3,"S",0,1,21,2,0,0,0,0,"","Serviço","Serviço","-","AGETOP",270501,"LIMPEZA FINAL DE OBRA - (OBRAS CIVIS)","m2    ",350,null,null,0,""]
[-1,null,-1,null,0,0,0,0,0,null,null,"F"]
[null,null,null,null,null,null,null,null,null,null,null,"F",null,null,null,null,null,"OBS: OS QUANTITATIVOS DE MATERIAIS  DAS INSTALAÇÕES HIDROSSANITÁRIAS, ELÉTRICAS E ESPECIAIS SÃO FORNECIDOS PELOS PROFISSIONAIS RESPONSÁVEIS PELOS RESPECTIVOS PROJETOS.",null,null,"VALOR TOTAL",null,0]
[null,null,null,null,null,null,null,null,null,null,null,"F",null,null,null,null,null,null,null,null,"VALOR BDI (26,40%)",null,0]
[null,null,null,null,null,null,null,null,null,null,null,"F",null,null,null,null,null,null,null,null,"TOTAL ORÇAMENTO",null,0]
[null,null,null,null,null,null,null,null,null,null,null,"F"]
[null,null,null,null,null,null,null,null,null,null,null,"F",null,null,null,null,null,null,null,null,"CUSTO POR M2 ³",null,0]
[null,null,null,null,null,null,null,null,null,null,null,"F",null,null,null,null,null,null,null,null,"MATERIAL S/ BDI",null,0]
[null,null,null,null,null,null,null,null,null,null,null,"F",null,null,null,null,null,null,null,null,"MÃO DE OBRA S/ BDI",null,0]
[null,null,null,null,null,null,null,null,null,null,null,"F"]
[null,null,null,null,null,null,null,null,null,null,null,"F",null,null,null,null,"(1) Conforme previsto pelo DECRETO Nº 7.983, DE 8 DE ABRIL DE 2013, os preços adotados são aqueles constantes dos sistemas de referência indicados. Justifica-se o uso dos preços destas composições de custos unitários devido ao seu valor ser menor à mediana de seus correspondentes na tabela SINAPI;"]
[null,null,null,null,null,null,null,null,null,null,null,"F",null,null,null,null,"(2) Optou-se pelo uso das composições de custos da AGETOP para itens não presentes na SINAPI;"]
[null,null,null,null,null,null,null,null,null,null,null,"F",null,null,null,null,"(3) Para itens da AGETOP, os vidros não estão inclusos nas esquadrias e já foram considerados os custos de contramarco para as esquadrias de alumínio;"]
[null,null,null,null,null,null,null,null,null,null,null,"F",null,null,null,null,"(4) Nos casos em que houver execução de granitina e omissão do item AGETOP 221102, considerou-se que o quantitativo para o rodapé, de altura igual a 7cm, foi incorporado na área de piso;"]
[null,null,null,null,null,null,null,null,null,null,null,"F",null,null,null,null,"(5) O custo unitário aproximado por metro quadrado é calculado dividindo-se o valor total do orçamento pela área total de construção."]
[null,null,null,null,null,null,null,null,null,null,null,"F"]
[null,null,null,null,null,null,null,null,null,null,null,"F"]
[]
[null,null,null,null,null,null,null,null,null,null,null,null,null,null,"SOMATÓRIO DE SERVIÇOS"]
[null,null,null,null,null,null,null,null,null,null,null,null,null,null,"ITEM","DESCRIÇÃO DOS SERVIÇOS",null,null,"PREÇO SEM BDI",null,null,"PREÇO COM BDI",null,"PARTICIPAÇÃO ( % )"]
[null,null,null,null,null,null,null,null,null,null,null,null,null,null,"a.","SERVIÇOS PRELIMINARES",null,null,{"$f":"SUMIF($R$19:$R$319,$P338,$W$19:$W$319)","v":0},null,null,{"$f":"ROUND(S338*(1+BDI.Taxa),2)","v":0},null,{"$f":"IFERROR(ROUND($V338*100/$W$322,2),0)","v":0}]
[null,null,null,null,null,null,null,null,null,null,null,null,null,null,"b.","TRANSPORTES",null,null,0,null,null,0,null,{"$f":"IFERROR(ROUND($V339*100/$W$322,2),0)","v":0}]
[null,null,null,null,null,null,null,null,null,null,null,null,null,null,"c.","SERVIÇO EM TERRA",null,null,0,null,null,0,null,0]
[null,null,null,null,null,null,null,null,null,null,null,null,null,null,"d.","FUNDAÇÕES E SONDAGENS",null,null,0,null,null,0,null,0]
[null,null,null,null,null,null,null,null,null,null,null,null,null,null,"e.","ESTRUTURA",null,null,0,null,null,0,null,0]
[null,null,null,null,null,null,null,null,null,null,null,null,null,null,"f.","INSTALAÇÕES ELÉTRICAS",null,null,0,null,null,0,null,0]
[null,null,null,null,null,null,null,null,null,null,null,null,null,null,"g.","INSTALAÇÕES HIDROSSANITÁRIAS",null,null,0,null,null,0,null,0]
[null,null,null,null,null,null,null,null,null,null,null,null,null,null,"h","INSTALAÇÕES ESPECIAIS",null,null,0,null,null,0,null,0]
[null,null,null,null,null,null,null,null,null,null,null,null,null,null,"i.","ALVENARIAS E DIVISÓRIAS",null,null,0,null,null,0,null,0]
[null,null,null,null,null,null,null,null,null,null,null,null,null,null,"j.","ALVENARIA AUTO-PORTANTE",null,null,0,null,null,0,null,0]
[null,null,null,null,null,null,null,null,null,null,null,null,null,null,"k.","IMPERMEABILIZAÇÃO",null,null,0,null,null,0,null,0]
[null,null,null,null,null,null,null,null,null,null,null,null,null,null,"l.","ISOLAMENTO TÉRMICO E ACÚSTICO",null,null,0,null,null,0,null,0]
[null,null,null,null,null,null,null,null,null,null,null,null,null,null,"m.","ESTRUTURA DE MADEIRA",null,null,0,null,null,0,null,0]
[null,null,null,null,null,null,null,null,null,null,null,null,null,null,"n.","ESTRUTURAS METÁLICAS",null,null,0,null,null,0,null,0]
[null,null,null,null,null,null,null,null,null,null,null,null,null,null,"o.","COBERTURAS",null,null,0,null,null,0,null,0]
[null,null,null,null,null,null,null,null,null,null,null,null,null,null,"p.","ESQUADRIAS DE MADEIRA",null,null,0,null,null,0,null,0]
[null,null,null,null,null,null,null,null,null,null,null,null,null,null,"q.","ESQUADRIAS METÁLICAS",null,null,0,null,null,{"$f":"ROUND(S354*(1+BDI.Taxa),2)","v":0},null,0]
[null,null,null,null,null,null,null,null,null,null,null,null,null,null,"r.","VIDROS",null,null,0,null,null,0,null,0]
[null,null,null,null,null,null,null,null,null,null,null,null,null,null,"s.","REVESTIMENTO DE PAREDE",null,null,0,null,null,0,null,0]
[null,null,null,null,null,null,null,null,null,null,null,null,null,null,"t.","FORROS",null,null,0,null,null,0,null,0]
[null,null,null,null,null,null,null,null,null,null,null,null,null,null,"u.","REVESTIMENTO DE PISO",null,null,0,null,null,0,null,0]
[null,null,null,null,null,null,null,null,null,null,null,null,null,null,"v.","FERRAGENS",null,null,0,null,null,0,null,0]
[null,null,null,null,null,null,null,null,null,null,null,null,null,null,"w.","MARCENARIA",null,null,0,null,null,0,null,0]
[null,null,null,null,null,null,null,null,null,null,null,null,null,null,"x.","ADMINISTRAÇÃO",null,null,0,null,null,0,null,0]
[null,null,null,null,null,null,null,null,null,null,null,null,null,null,"y.","PINTURA",null,null,0,null,null,{"$f":"ROUND(S362*(1+BDI.Taxa),2)","v":0},null,0]
[null,null,null,null,null,null,null,null,null,null,null,null,null,null,"z.","DIVERSOS",null,null,0,null,null,{"$f":"IF(S363>0,IF((SUM(V338:W362)+ROUND(S363*(1+BDI.Taxa),2))<>V365,V365-SUM(V338:W362),ROUND(S363*(1+BDI.Taxa),2)),0)","v":0},null,{"$f":"IF(S363>0,IF((SUM(X338:X362)+IFERROR(ROUND($V363*100/$W$322,2),0))<>X365,X365-SUM(X338:X362),IFERROR(ROUND($V363*100/$W$322,2),0)),0)","v":0}]
[null,null,null,null,null,null,null,null,null,null,null,null,null,null,"TOTAL GERAL DO ORÇAMENTO (R$)",null,null,null,{"$f":"SUM(S338:U363)","v":0},null,null,{"$f":"SUM(V338:W363)","v":0},null,{"$f":"SUM(X338:X363)","v":0}]
[null,null,null,null,null,null,null,null,null,null,null,null,null,null,null,null,null,null,{"$f":"$W$320","v":0},null,null,{"$f":"$W$322","v":0},null,100]
[null,null,null,null,null,null,null,null,null,null,null,null,null,null,null,null,null,null,"(TOTAL SEM BDI)",null,null,"(TOTAL COM BDI)",null,"(ARRED porcentagem)"]
[null,null,null,null,null,null,null,null,null,null,null,null,null,null,null,null,null,null,{"$f":"IF(AND(S364=S365,S364>0),\"OK\",\"ERRO\")","v":"ERRO"},null,null,{"$f":"IF(AND(V364=V365,V364>0),\"OK\",\"ERRO\")","v":"ERRO"},null,{"$f":"IF(X364=100,\"OK\",\"ERRO\")","v":"ERRO"}]
[]
[]
[null,null,null,null,null,null,null,null,null,null,null,null,null,null,"RESUMO GERAL DO ORÇAMENTO"]
[null,null,null,null,null,null,null,null,null,null,null,null,null,null,"ITEM","DESCRIÇÃO DOS SERVIÇOS",null,null,"PREÇO SEM BDI",null,null,"PREÇO COM BDI",null,"PARTICIPAÇÃO ( % )"]
[null,null,null,null,null,null,null,null,null,null,null,null,null,null,"1.",{"$f":"IFERROR(VLOOKUP(O372,$O$19:$W$319,4,FALSE),\"\")","v":"REFORMA"},null,null,{"$f":"IF(P373=\"\",$S$393-SUM(OFFSET($S$371:S371,0,0,COUNTA($S$371:S371),1)),SUMIF($R$19:$R$319,$P372,$W$19:$W$319))","v":0},null,null,{"$f":"IF(P373=\"\",$V$393-SUM(OFFSET($V$371:V371,0,0,COUNTA($V$371:V371),1)),ROUND(S372*(1+BDI.Taxa),2))","v":0},null,{"$f":"IF(P373=\"\",$X$393-SUM(OFFSET($X$371:X371,0,0,COUNTA($X$371:X371),1)),ROUND(V372*100/ORÇAMENTO.Totalorçamento,2))","v":100}]
[null,null,null,null,null,null,null,null,null,null,null,null,null,null,"2.","",null,null,{"$f":"IF(P374=\"\",$S$393-SUM(OFFSET($S$371:S372,0,0,COUNTA($S$371:S372),1)),SUMIF($R$19:$R$319,$P373,$W$19:$W$319))","v":0},null,null,{"$f":"IF(P374=\"\",$V$393-SUM(OFFSET($V$371:V372,0,0,COUNTA($V$371:V372),1)),ROUND(S373*(1+BDI.Taxa),2))","v":0},null,{"$f":"IF(P374=\"\",$X$393-SUM(OFFSET($X$371:X372,0,0,COUNTA($X$371:X372),1)),ROUND(V373*100/ORÇAMENTO.Totalorçamento,2))","v":0}]
[null,null,null,null,null,null,null,null,null,null,null,null,null,null,"3.","",null,null,{"$f":"IF(P375=\"\",$S$393-SUM(OFFSET($S$371:S373,0,0,COUNTA($S$371:S373),1)),SUMIF($R$19:$R$319,$P374,$W$19:$W$319))","v":0},null,null,{"$f":"IF(P375=\"\",$V$393-SUM(OFFSET($V$371:V373,0,0,COUNTA($V$371:V373),1)),ROUND(S374*(1+BDI.Taxa),2))","v":0},null,{"$f":"IF(P375=\"\",$X$393-SUM(OFFSET($X$371:X373,0,0,COUNTA($X$371:X373),1)),ROUND(V374*100/ORÇAMENTO.Totalorçamento,2))","v":0}]
[null,null,null,null,null,null,null,null,null,null,null,null,null,null,"4.","",null,null,{"$f":"IF(P376=\"\",$S$393-SUM(OFFSET($S$371:S374,0,0,COUNTA($S$371:S374),1)),SUMIF($R$19:$R$319,$P375,$W$19:$W$319))","v":0},null,null,{"$f":"IF(P376=\"\",$V$393-SUM(OFFSET($V$371:V374,0,0,COUNTA($V$371:V374),1)),ROUND(S375*(1+BDI.Taxa),2))","v":0},null,{"$f":"IF(P376=\"\",$X$393-SUM(OFFSET($X$371:X374,0,0,COUNTA($X$371:X374),1)),ROUND(V375*100/ORÇAMENTO.Totalorçamento,2))","v":0}]
[null,null,null,null,null,null,null,null,null,null,null,null,null,null,"5.","",null,null,{"$f":"IF(P377=\"\",$S$393-SUM(OFFSET($S$371:S375,0,0,COUNTA($S$371:S375),1)),SUMIF($R$19:$R$319,$P376,$W$19:$W$319))","v":0},null,null,{"$f":"IF(P377=\"\",$V$393-SUM(OFFSET($V$371:V375,0,0,COUNTA($V$371:V375),1)),ROUND(S376*(1+BDI.Taxa),2))","v":0},null,{"$f":"IF(P377=\"\",$X$393-SUM(OFFSET($X$371:X375,0,0,COUNTA($X$371:X375),1)),ROUND(V376*100/ORÇAMENTO.Totalorçamento,2))","v":0}]
[null,null,null,null,null,null,null,null,null,null,null,null,null,null,"6.","",null,null,{"$f":"IF(P378=\"\",$S$393-SUM(OFFSET($S$371:S376,0,0,COUNTA($S$371:S376),1)),SUMIF($R$19:$R$319,$P377,$W$19:$W$319))","v":0},null,null,{"$f":"IF(P378=\"\",$V$393-SUM(OFFSET($V$371:V376,0,0,COUNTA($V$371:V376),1)),ROUND(S377*(1+BDI.Taxa),2))","v":0},null,{"$f":"IF(P378=\"\",$X$393-SUM(OFFSET($X$371:X376,0,0,COUNTA($X$371:X376),1)),ROUND(V377*100/ORÇAMENTO.Totalorçamento,2))","v":0}]
[null,null,null,null,null,null,null,null,null,null,null,null,null,null,"7.","",null,null,{"$f":"IF(P379=\"\",$S$393-SUM(OFFSET($S$371:S377,0,0,COUNTA($S$371:S377),1)),SUMIF($R$19:$R$319,$P378,$W$19:$W$319))","v":0},null,null,{"$f":"IF(P379=\"\",$V$393-SUM(OFFSET($V$371:V377,0,0,COUNTA($V$371:V377),1)),ROUND(S378*(1+BDI.Taxa),2))","v":0},null,{"$f":"IF(P379=\"\",$X$393-SUM(OFFSET($X$371:X377,0,0,COUNTA($X$371:X377),1)),ROUND(V378*100/ORÇAMENTO.Totalorçamento,2))","v":0}]
[null,null,null,null,null,null,null,null,null,null,null,null,null,null,"8.","",null,null,{"$f":"IF(P380=\"\",$S$393-SUM(OFFSET($S$371:S378,0,0,COUNTA($S$371:S378),1)),SUMIF($R$19:$R$319,$P379,$W$19:$W$319))","v":0},null,null,{"$f":"IF(P380=\"\",$V$393-SUM(OFFSET($V$371:V378,0,0,COUNTA($V$371:V378),1)),ROUND(S379*(1+BDI.Taxa),2))","v":0},null,{"$f":"IF(P380=\"\",$X$393-SUM(OFFSET($X$371:X378,0,0,COUNTA($X$371:X378),1)),ROUND(V379*100/ORÇAMENTO.Totalorçamento,2))","v":0}]
[null,null,null,null,null,null,null,null,null,null,null,null,null,null,"9.","",null,null,{"$f":"IF(P381=\"\",$S$393-SUM(OFFSET($S$371:S379,0,0,COUNTA($S$371:S379),1)),SUMIF($R$19:$R$319,$P380,$W$19:$W$319))","v":0},null,null,{"$f":"IF(P381=\"\",$V$393-SUM(OFFSET($V$371:V379,0,0,COUNTA($V$371:V379),1)),ROUND(S380*(1+BDI.Taxa),2))","v":0},null,{"$f":"IF(P381=\"\",$X$393-SUM(OFFSET($X$371:X379,0,0,COUNTA($X$371:X379),1)),ROUND(V380*100/ORÇAMENTO.Totalorçamento,2))","v":0}]
[null,null,null,null,null,null,null,null,null,null,null,null,null,null,"10.","",null,null,{"$f":"IF(P382=\"\",$S$393-SUM(OFFSET($S$371:S380,0,0,COUNTA($S$371:S380),1)),SUMIF($R$19:$R$319,$P381,$W$19:$W$319))","v":0},null,null,{"$f":"IF(P382=\"\",$V$393-SUM(OFFSET($V$371:V380,0,0,COUNTA($V$371:V380),1)),ROUND(S381*(1+BDI.Taxa),2))","v":0},null,{"$f":"IF(P382=\"\",$X$393-SUM(OFFSET($X$371:X380,0,0,COUNTA($X$371:X380),1)),ROUND(V381*100/ORÇAMENTO.Totalorçamento,2))","v":0}]
[null,null,null,null,null,null,null,null,null,null,null,null,null,null,"11.","",null,null,{"$f":"IF(P383=\"\",$S$393-SUM(OFFSET($S$371:S381,0,0,COUNTA($S$371:S381),1)),SUMIF($R$19:$R$319,$P382,$W$19:$W$319))","v":0},null,null,{"$f":"IF(P383=\"\",$V$393-SUM(OFFSET($V$371:V381,0,0,COUNTA($V$371:V381),1)),ROUND(S382*(1+BDI.Taxa),2))","v":0},null,{"$f":"IF(P383=\"\",$X$393-SUM(OFFSET($X$371:X381,0,0,COUNTA($X$371:X381),1)),ROUND(V382*100/ORÇAMENTO.Totalorçamento,2))","v":0}]
[null,null,null,null,null,null,null,null,null,null,null,null,null,null,"12.","",null,null,{"$f":"IF(P384=\"\",$S$393-SUM(OFFSET($S$371:S382,0,0,COUNTA($S$371:S382),1)),SUMIF($R$19:$R$319,$P383,$W$19:$W$319))","v":0},null,null,{"$f":"IF(P384=\"\",$V$393-SUM(OFFSET($V$371:V382,0,0,COUNTA($V$371:V382),1)),ROUND(S383*(1+BDI.Taxa),2))","v":0},null,{"$f":"IF(P384=\"\",$X$393-SUM(OFFSET($X$371:X382,0,0,COUNTA($X$371:X382),1)),ROUND(V383*100/ORÇAMENTO.Totalorçamento,2))","v":0}]
[null,null,null,null,null,null,null,null,null,null,null,null,null,null,"13.","",null,null,{"$f":"IF(P385=\"\",$S$393-SUM(OFFSET($S$371:S383,0,0,COUNTA($S$371:S383),1)),SUMIF($R$19:$R$319,$P384,$W$19:$W$319))","v":0},null,null,{"$f":"IF(P385=\"\",$V$393-SUM(OFFSET($V$371:V383,0,0,COUNTA($V$371:V383),1)),ROUND(S384*(1+BDI.Taxa),2))","v":0},null,{"$f":"IF(P385=\"\",$X$393-SUM(OFFSET($X$371:X383,0,0,COUNTA($X$371:X383),1)),ROUND(V384*100/ORÇAMENTO.Totalorçamento,2))","v":0}]
[null,null,null,null,null,null,null,null,null,null,null,null,null,null,"14.","",null,null,{"$f":"IF(P386=\"\",$S$393-SUM(OFFSET($S$371:S384,0,0,COUNTA($S$371:S384),1)),SUMIF($R$19:$R$319,$P385,$W$19:$W$319))","v":0},null,null,{"$f":"IF(P386=\"\",$V$393-SUM(OFFSET($V$371:V384,0,0,COUNTA($V$371:V384),1)),ROUND(S385*(1+BDI.Taxa),2))","v":0},null,{"$f":"IF(P386=\"\",$X$393-SUM(OFFSET($X$371:X384,0,0,COUNTA($X$371:X384),1)),ROUND(V385*100/ORÇAMENTO.Totalorçamento,2))","v":0}]
[null,null,null,null,null,null,null,null,null,null,null,null,null,null,"15.","",null,null,{"$f":"IF(P387=\"\",$S$393-SUM(OFFSET($S$371:S385,0,0,COUNTA($S$371:S385),1)),SUMIF($R$19:$R$319,$P386,$W$19:$W$319))","v":0},null,null,{"$f":"IF(P387=\"\",$V$393-SUM(OFFSET($V$371:V385,0,0,COUNTA($V$371:V385),1)),ROUND(S386*(1+BDI.Taxa),2))","v":0},null,{"$f":"IF(P387=\"\",$X$393-SUM(OFFSET($X$371:X385,0,0,COUNTA($X$371:X385),1)),ROUND(V386*100/ORÇAMENTO.Totalorçamento,2))","v":0}]
[null,null,null,null,null,null,null,null,null,null,null,null,null,null,"16.","",null,null,{"$f":"IF(P388=\"\",$S$393-SUM(OFFSET($S$371:S386,0,0,COUNTA($S$371:S386),1)),SUMIF($R$19:$R$319,$P387,$W$19:$W$319))","v":0},null,null,{"$f":"IF(P388=\"\",$V$393-SUM(OFFSET($V$371:V386,0,0,COUNTA($V$371:V386),1)),ROUND(S387*(1+BDI.Taxa),2))","v":0},null,{"$f":"IF(P388=\"\",$X$393-SUM(OFFSET($X$371:X386,0,0,COUNTA($X$371:X386),1)),ROUND(V387*100/ORÇAMENTO.Totalorçamento,2))","v":0}]
[null,null,null,null,null,null,null,null,null,null,null,null,null,null,"17.","",null,null,{"$f":"IF(P389=\"\",$S$393-SUM(OFFSET($S$371:S387,0,0,COUNTA($S$371:S387),1)),SUMIF($R$19:$R$319,$P388,$W$19:$W$319))","v":0},null,null,{"$f":"IF(P389=\"\",$V$393-SUM(OFFSET($V$371:V387,0,0,COUNTA($V$371:V387),1)),ROUND(S388*(1+BDI.Taxa),2))","v":0},null,{"$f":"IF(P389=\"\",$X$393-SUM(OFFSET($X$371:X387,0,0,COUNTA($X$371:X387),1)),ROUND(V388*100/ORÇAMENTO.Totalorçamento,2))","v":0}]
[null,null,null,null,null,null,null,null,null,null,null,null,null,null,"18.","",null,null,{"$f":"IF(P390=\"\",$S$393-SUM(OFFSET($S$371:S388,0,0,COUNTA($S$371:S388),1)),SUMIF($R$19:$R$319,$P389,$W$19:$W$319))","v":0},null,null,{"$f":"IF(P390=\"\",$V$393-SUM(OFFSET($V$371:V388,0,0,COUNTA($V$371:V388),1)),ROUND(S389*(1+BDI.Taxa),2))","v":0},null,{"$f":"IF(P390=\"\",$X$393-SUM(OFFSET($X$371:X388,0,0,COUNTA($X$371:X388),1)),ROUND(V389*100/ORÇAMENTO.Totalorçamento,2))","v":0}]
[null,null,null,null,null,null,null,null,null,null,null,null,null,null,"19.","",null,null,{"$f":"IF(P391=\"\",$S$393-SUM(OFFSET($S$371:S389,0,0,COUNTA($S$371:S389),1)),SUMIF($R$19:$R$319,$P390,$W$19:$W$319))","v":0},null,null,{"$f":"IF(P391=\"\",$V$393-SUM(OFFSET($V$371:V389,0,0,COUNTA($V$371:V389),1)),ROUND(S390*(1+BDI.Taxa),2))","v":0},null,{"$f":"IF(P391=\"\",$X$393-SUM(OFFSET($X$371:X389,0,0,COUNTA($X$371:X389),1)),ROUND(V390*100/ORÇAMENTO.Totalorçamento,2))","v":0}]
[null,null,null,null,null,null,null,null,null,null,null,null,null,null,"20.","",null,null,{"$f":"IF(P392=\"\",$S$393-SUM(OFFSET($S$371:S390,0,0,COUNTA($S$371:S390),1)),SUMIF($R$19:$R$319,$P391,$W$19:$W$319))","v":0},null,null,{"$f":"IF(P392=\"\",$V$393-SUM(OFFSET($V$371:V390,0,0,COUNTA($V$371:V390),1)),ROUND(S391*(1+BDI.Taxa),2))","v":0},null,{"$f":"IF(P392=\"\",$X$393-SUM(OFFSET($X$371:X390,0,0,COUNTA($X$371:X390),1)),ROUND(V391*100/ORÇAMENTO.Totalorçamento,2))","v":0}]
[null,null,null,null,null,null,null,null,null,null,null,null,null,null,"TOTAL GERAL DO ORÇAMENTO (R$)",null,null,null,{"$f":"SUM(S372:U391)","v":0},null,null,{"$f":"SUM(V372:W391)","v":0},null,{"$f":"SUM(X372:X391)","v":100}]
[null,null,null,null,null,null,null,null,null,null,null,null,null,null,null,null,null,null,{"$f":"$W$320","v":0},null,null,{"$f":"$W$322","v":0},null,100]
[null,null,null,null,null,null,null,null,null,null,null,null,null,null,null,null,null,null,"(TOTAL SEM BDI)",null,null,"(TOTAL COM BDI)",null,"(ARRED porcentagem)"]
[null,null,null,null,null,null,null,null,null,null,null,null,null,null,null,null,null,null,{"$f":"IF(AND(S392=S393,S392>0),\"OK\",\"ERRO\")","v":"ERRO"},null,null,{"$f":"IF(AND(V392=V393,V392>0),\"OK\",\"ERRO\")","v":"ERRO"},null,{"$f":"IF(AND(X392=100,S372<>0),\"OK\",\"ERRO\")","v":"ERRO"}]

{"sheet":"Resumo ","index":1,"n_rows":39,"n_cols":9,"rows_kept":39,"cut":false,"hidden":false,"merged":[[13,0,14,0],[34,2,34,3],[35,2,35,3],[31,2,31,3],[32,2,32,3],[33,2,33,3],[28,2,28,3],[29,2,29,3],[30,2,30,3],[0,1,0,8],[36,1,36,5],[2,1,2,5],[3,1,3,5],[5,1,5,5],[6,1,6,5],[8,1,8,5],[9,1,9,5],[11,3,11,5],[12,3,12,5],[10,1,10,8],[11,6,11,8],[12,6,12,8],[25,2,25,3],[21,2,21,3],[22,2,22,3],[6,6,6,8],[7,1,7,8],[8,6,8,8],[9,6,9,8],[13,1,13,8],[1,1,1,8],[2,6,2,8],[3,6,3,8],[4,1,4,8],[5,6,5,8],[42,3,42,7],[11,1,11,2],[12,1,12,2],[15,2,15,3],[16,2,16,3],[14,1,14,8],[17,2,17,3],[23,2,23,3],[18,2,18,3],[19,2,19,3],[20,2,20,3],[41,3,41,7],[24,2,24,3],[26,2,26,3],[27,2,27,3],[38,1,38,8]]}
[]
[]
[null,"UNIDADE ESCOLAR",null,null,null,null,"CÓDIGO INEP"]
[null,{"$f":"Orçamento!$O$4","v":"CENTRO DE ATENDIMENTO EDUCACIONAL ESPECIALIZADO DE IPORÁ"},null,null,null,null,{"$f":"Orçamento!V4","v":52070069}]
[]
[null,"OBRA",null,null,null,null,"CIDADE"]
[null,{"$f":"Orçamento!$O$7","v":"REFORMA"},null,null,null,null,{"$f":"Orçamento!$V$7","v":"IPORÁ"}]
[]
[null,"ENDEREÇO",null,null,null,null,"CRE"]
[null,{"$f":"Orçamento!$R$10","v":"AV DR NETO ESQ. C/ RUA GOIÂNIA S/N, CENTRO, CEP:76200-000"},null,null,null,null,{"$f":"Orçamento!$O$10","v":"IPORÁ"}]
[]
[null,"REFERÊNCIA",null,"DATA",null,null,"ÁREA TOTAL CONSTRUÍDA (M²)"]
[null,{"$f":"CONCATENATE(\"AGETOP E SINAPI - \",Orçamento!$T$10)","v":"AGETOP E SINAPI - DESONERADA"},null,{"$f":"Orçamento!$S$7","v":"2020-04-06"},null,null,{"$f":"Orçamento!$V$13","v":643.09999999999991}]
["FILTRO"]
[null,"RESUMO GERAL DO ORÇAMENTO"]
["↓","ITEM","DESCRIÇÃO DOS SERVIÇOS",null,"UNID","QUANT","PREÇO SEM BDI","PREÇO COM BDI","PARTICIP. (%)"]
[{"$f":"IF(H17>0,\"F\",\"\")","v":""},"1.",{"$f":"Orçamento!$P372","v":"REFORMA"},null,{"$f":"IF(C17<>\"\",\"UN\",\"\")","v":"UN"},{"$f":"IF(C17<>\"\",1,\"\")","v":1},{"$f":"IFERROR(Orçamento!S372,\"-\")","v":0},{"$f":"IFERROR(Orçamento!V372,\"\")","v":0},{"$f":"Orçamento!X372","v":100}]
[{"$f":"IF(H18>0,\"F\",\"\")","v":""},"2.",{"$f":"Orçamento!$P373","v":""},null,{"$f":"IF(C18<>\"\",\"UN\",\"\")","v":""},{"$f":"IF(C18<>\"\",1,\"\")","v":""},{"$f":"IFERROR(Orçamento!S373,\"-\")","v":0},{"$f":"IFERROR(Orçamento!V373,\"\")","v":0},{"$f":"Orçamento!X373","v":0}]
[{"$f":"IF(H19>0,\"F\",\"\")","v":""},"3.",{"$f":"Orçamento!$P374","v":""},null,"","",{"$f":"IFERROR(Orçamento!S374,\"-\")","v":0},{"$f":"IFERROR(Orçamento!V374,\"\")","v":0},{"$f":"Orçamento!X374","v":0}]
["","4.",{"$f":"Orçamento!$P375","v":""},null,"","",{"$f":"IFERROR(Orçamento!S375,\"-\")","v":0},{"$f":"IFERROR(Orçamento!V375,\"\")","v":0},{"$f":"Orçamento!X375","v":0}]
["","5.",{"$f":"Orçamento!$P376","v":""},null,"","",{"$f":"IFERROR(Orçamento!S376,\"-\")","v":0},{"$f":"IFERROR(Orçamento!V376,\"\")","v":0},{"$f":"Orçamento!X376","v":0}]
["","6.",{"$f":"Orçamento!$P377","v":""},null,"","",{"$f":"IFERROR(Orçamento!S377,\"-\")","v":0},{"$f":"IFERROR(Orçamento!V377,\"\")","v":0},{"$f":"Orçamento!X377","v":0}]
["","7.",{"$f":"Orçamento!$P378","v":""},null,"","",{"$f":"IFERROR(Orçamento!S378,\"-\")","v":0},{"$f":"IFERROR(Orçamento!V378,\"\")","v":0},{"$f":"Orçamento!X378","v":0}]
["","8.",{"$f":"Orçamento!$P379","v":""},null,"","",{"$f":"IFERROR(Orçamento!S379,\"-\")","v":0},{"$f":"IFERROR(Orçamento!V379,\"\")","v":0},{"$f":"Orçamento!X379","v":0}]
["","9.",{"$f":"Orçamento!$P380","v":""},null,"","",{"$f":"IFERROR(Orçamento!S380,\"-\")","v":0},{"$f":"IFERROR(Orçamento!V380,\"\")","v":0},{"$f":"Orçamento!X380","v":0}]
["","10.",{"$f":"Orçamento!$P381","v":""},null,"","",{"$f":"IFERROR(Orçamento!S381,\"-\")","v":0},{"$f":"IFERROR(Orçamento!V381,\"\")","v":0},{"$f":"Orçamento!X381","v":0}]
["","11.",{"$f":"Orçamento!$P382","v":""},null,"","",{"$f":"IFERROR(Orçamento!S382,\"-\")","v":0},{"$f":"IFERROR(Orçamento!V382,\"\")","v":0},{"$f":"Orçamento!X382","v":0}]
["","12.",{"$f":"Orçamento!$P383","v":""},null,"","",{"$f":"IFERROR(Orçamento!S383,\"-\")","v":0},{"$f":"IFERROR(Orçamento!V383,\"\")","v":0},{"$f":"Orçamento!X383","v":0}]
["","13.",{"$f":"Orçamento!$P384","v":""},null,"","",{"$f":"IFERROR(Orçamento!S384,\"-\")","v":0},{"$f":"IFERROR(Orçamento!V384,\"\")","v":0},{"$f":"Orçamento!X384","v":0}]
["","14.",{"$f":"Orçamento!$P385","v":""},null,"","",{"$f":"IFERROR(Orçamento!S385,\"-\")","v":0},{"$f":"IFERROR(Orçamento!V385,\"\")","v":0},{"$f":"Orçamento!X385","v":0}]
["","15.",{"$f":"Orçamento!$P386","v":""},null,"","",{"$f":"IFERROR(Orçamento!S386,\"-\")","v":0},{"$f":"IFERROR(Orçamento!V386,\"\")","v":0},{"$f":"Orçamento!X386","v":0}]
["","16.",{"$f":"Orçamento!$P387","v":""},null,"","",{"$f":"IFERROR(Orçamento!S387,\"-\")","v":0},{"$f":"IFERROR(Orçamento!V387,\"\")","v":0},{"$f":"Orçamento!X387","v":0}]
["","17.",{"$f":"Orçamento!$P388","v":""},null,"","",{"$f":"IFERROR(Orçamento!S388,\"-\")","v":0},{"$f":"IFERROR(Orçamento!V388,\"\")","v":0},{"$f":"Orçamento!X388","v":0}]
["","18.",{"$f":"Orçamento!$P389","v":""},null,"","",{"$f":"IFERROR(Orçamento!S389,\"-\")","v":0},{"$f":"IFERROR(Orçamento!V389,\"\")","v":0},{"$f":"Orçamento!X389","v":0}]
["","19.",{"$f":"Orçamento!$P390","v":""},null,"","",{"$f":"IFERROR(Orçamento!S390,\"-\")","v":0},{"$f":"IFERROR(Orçamento!V390,\"\")","v":0},{"$f":"Orçamento!X390","v":0}]
["","20.",{"$f":"Orçamento!$P391","v":""},null,"","",{"$f":"IFERROR(Orçamento!S391,\"-\")","v":0},{"$f":"IFERROR(Orçamento!V391,\"\")","v":0},{"$f":"Orçamento!X391","v":0}]
["F","TOTAL GERAL DO ORÇAMENTO (R$)",null,null,null,null,{"$f":"SUM(G17:G36)","v":0},{"$f":"SUM(H17:H36)","v":0},{"$f":"SUM(I17:I36)","v":100}]
["F"]
["F"]

{"sheet":"Somatório","index":2,"n_rows":45,"n_cols":8,"rows_kept":45,"cut":false,"hidden":false,"merged":[[13,0,14,0],[42,1,42,2],[44,1,44,5],[47,3,47,5],[48,3,48,5],[13,1,13,5],[9,1,9,3],[9,4,9,5],[11,1,11,2],[11,4,11,5],[12,1,12,2],[12,4,12,5],[0,1,0,5],[14,1,14,5],[2,1,2,3],[2,4,2,5],[3,1,3,3],[3,4,3,5],[5,1,5,3],[5,4,5,5],[6,1,6,3],[6,4,6,5],[8,1,8,3],[8,4,8,5],[1,1,1,5],[4,1,4,5],[7,1,7,5],[10,1,10,5]]}
[]
[]
[null,"UNIDADE ESCOLAR",null,null,"CÓDIGO INEP"]
[null,{"$f":"Orçamento!$O$4","v":"CENTRO DE ATENDIMENTO EDUCACIONAL ESPECIALIZADO DE IPORÁ"},null,null,{"$f":"Orçamento!V4","v":52070069}]
[]
[null,"OBRA",null,null,"CIDADE"]
[null,{"$f":"Orçamento!$O$7","v":"REFORMA"},null,null,{"$f":"Orçamento!$V$7","v":"IPORÁ"}]
[null,null,null,null,null,null,null,"DESONERADA"]
[null,"ENDEREÇO",null,null,"CRE"]
[null,{"$f":"Orçamento!$R$10","v":"AV DR NETO ESQ. C/ RUA GOIÂNIA S/N, CENTRO, CEP:76200-000"},null,null,{"$f":"Orçamento!$O$10","v":"IPORÁ"}]
[]
[null,"REFERÊNCIA",null,"DATA","ÁREA TOTAL CONSTRUÍDA (M²)"]
[null,{"$f":"CONCATENATE(\"AGETOP E SINAPI - \",Orçamento!$T$10)","v":"AGETOP E SINAPI - DESONERADA"},null,{"$f":"Orçamento!$S$7","v":"2020-04-06"},{"$f":"Orçamento!$V$13","v":643.09999999999991}]
["FILTRO"]
[null,"SOMATÓRIO DE SERVIÇOS"]
["↓","ITEM","DESCRIÇÃO DOS SERVIÇOS","PREÇO SEM BDI (R$)","PREÇO COM BDI (R$)","PARTIC.  ( % )"]
[{"$f":"IF(D17>0,\"F\",\"\")","v":""},"a.",{"$f":"Orçamento!P338","v":"SERVIÇOS PRELIMINARES"},{"$f":"Orçamento!S338","v":0},{"$f":"Orçamento!V338","v":0},{"$f":"Orçamento!X338","v":0}]
[{"$f":"IF(D18>0,\"F\",\"\")","v":""},"b.",{"$f":"Orçamento!P339","v":"TRANSPORTES"},{"$f":"Orçamento!S339","v":0},{"$f":"Orçamento!V339","v":0},{"$f":"Orçamento!X339","v":0}]
["","c.",{"$f":"Orçamento!P340","v":"SERVIÇO EM TERRA"},{"$f":"Orçamento!S340","v":0},{"$f":"Orçamento!V340","v":0},{"$f":"Orçamento!X340","v":0}]
["","d.",{"$f":"Orçamento!P341","v":"FUNDAÇÕES E SONDAGENS"},{"$f":"Orçamento!S341","v":0},{"$f":"Orçamento!V341","v":0},{"$f":"Orçamento!X341","v":0}]
["","e.",{"$f":"Orçamento!P342","v":"ESTRUTURA"},{"$f":"Orçamento!S342","v":0},{"$f":"Orçamento!V342","v":0},{"$f":"Orçamento!X342","v":0}]
["","f.",{"$f":"Orçamento!P343","v":"INSTALAÇÕES ELÉTRICAS"},{"$f":"Orçamento!S343","v":0},{"$f":"Orçamento!V343","v":0},{"$f":"Orçamento!X343","v":0}]
["","g.",{"$f":"Orçamento!P344","v":"INSTALAÇÕES HIDROSSANITÁRIAS"},{"$f":"Orçamento!S344","v":0},{"$f":"Orçamento!V344","v":0},{"$f":"Orçamento!X344","v":0}]
["","h.",{"$f":"Orçamento!P345","v":"INSTALAÇÕES ESPECIAIS"},{"$f":"Orçamento!S345","v":0},{"$f":"Orçamento!V345","v":0},{"$f":"Orçamento!X345","v":0}]
["","i.",{"$f":"Orçamento!P346","v":"ALVENARIAS E DIVISÓRIAS"},{"$f":"Orçamento!S346","v":0},{"$f":"Orçamento!V346","v":0},{"$f":"Orçamento!X346","v":0}]
["","j.",{"$f":"Orçamento!P347","v":"ALVENARIA AUTO-PORTANTE"},{"$f":"Orçamento!S347","v":0},{"$f":"Orçamento!V347","v":0},{"$f":"Orçamento!X347","v":0}]
["","k.",{"$f":"Orçamento!P348","v":"IMPERMEABILIZAÇÃO"},{"$f":"Orçamento!S348","v":0},{"$f":"Orçamento!V348","v":0},{"$f":"Orçamento!X348","v":0}]
["","l.",{"$f":"Orçamento!P349","v":"ISOLAMENTO TÉRMICO E ACÚSTICO"},{"$f":"Orçamento!S349","v":0},{"$f":"Orçamento!V349","v":0},{"$f":"Orçamento!X349","v":0}]
["","m.",{"$f":"Orçamento!P350","v":"ESTRUTURA DE MADEIRA"},{"$f":"Orçamento!S350","v":0},{"$f":"Orçamento!V350","v":0},{"$f":"Orçamento!X350","v":0}]
["","n.",{"$f":"Orçamento!P351","v":"ESTRUTURAS METÁLICAS"},{"$f":"Orçamento!S351","v":0},{"$f":"Orçamento!V351","v":0},{"$f":"Orçamento!X351","v":0}]
["","o.",{"$f":"Orçamento!P352","v":"COBERTURAS"},{"$f":"Orçamento!S352","v":0},{"$f":"Orçamento!V352","v":0},{"$f":"Orçamento!X352","v":0}]
["","p.",{"$f":"Orçamento!P353","v":"ESQUADRIAS DE MADEIRA"},{"$f":"Orçamento!S353","v":0},{"$f":"Orçamento!V353","v":0},{"$f":"Orçamento!X353","v":0}]
["","q.",{"$f":"Orçamento!P354","v":"ESQUADRIAS METÁLICAS"},{"$f":"Orçamento!S354","v":0},{"$f":"Orçamento!V354","v":0},{"$f":"Orçamento!X354","v":0}]
["","r.",{"$f":"Orçamento!P355","v":"VIDROS"},{"$f":"Orçamento!S355","v":0},{"$f":"Orçamento!V355","v":0},{"$f":"Orçamento!X355","v":0}]
["","s.",{"$f":"Orçamento!P356","v":"REVESTIMENTO DE PAREDE"},{"$f":"Orçamento!S356","v":0},{"$f":"Orçamento!V356","v":0},{"$f":"Orçamento!X356","v":0}]
["","t.",{"$f":"Orçamento!P357","v":"FORROS"},{"$f":"Orçamento!S357","v":0},{"$f":"Orçamento!V357","v":0},{"$f":"Orçamento!X357","v":0}]
["","u.",{"$f":"Orçamento!P358","v":"REVESTIMENTO DE PISO"},{"$f":"Orçamento!S358","v":0},{"$f":"Orçamento!V358","v":0},{"$f":"Orçamento!X358","v":0}]
["","v.",{"$f":"Orçamento!P359","v":"FERRAGENS"},{"$f":"Orçamento!S359","v":0},{"$f":"Orçamento!V359","v":0},{"$f":"Orçamento!X359","v":0}]
["","w.",{"$f":"Orçamento!P360","v":"MARCENARIA"},{"$f":"Orçamento!S360","v":0},{"$f":"Orçamento!V360","v":0},{"$f":"Orçamento!X360","v":0}]
["","x.",{"$f":"Orçamento!P361","v":"ADMINISTRAÇÃO"},{"$f":"Orçamento!S361","v":0},{"$f":"Orçamento!V361","v":0},{"$f":"Orçamento!X361","v":0}]
["","y.",{"$f":"Orçamento!P362","v":"PINTURA"},{"$f":"Orçamento!S362","v":0},{"$f":"Orçamento!V362","v":0},{"$f":"Orçamento!X362","v":0}]
["","z.",{"$f":"Orçamento!P363","v":"DIVERSOS"},{"$f":"Orçamento!S363","v":0},{"$f":"Orçamento!V363","v":0},{"$f":"Orçamento!X363","v":0}]
["F","TOTAL GERAL DO ORÇAMENTO",null,{"$f":"SUM(D17:D42)","v":0},{"$f":"SUM(E17:E42)","v":0},{"$f":"SUM(F17:F42)","v":0}]
[]
[null,"(*) Para itens da AGETOP, os vidros não estão inclusos nas esquadrias e já foram considerados os custos de contramarco para as esquadrias de alumínio;"]

{"sheet":"Cronog_60_Dias","index":3,"n_rows":99,"n_cols":16,"rows_kept":99,"cut":false,"hidden":false,"merged":[[2,1,2,7],[5,1,5,7],[6,1,6,7],[8,1,8,7],[9,1,9,7],[4,1,4,13],[7,1,7,13],[0,1,0,13],[1,1,1,13],[2,8,2,13],[12,0,13,0],[9,0,11,0],[11,1,11,13],[92,1,92,2],[92,5,92,8],[92,9,92,12],[93,1,93,2],[93,5,93,8],[93,9,93,12],[74,9,74,12],[74,5,74,8],[68,9,68,12],[70,5,70,8],[70,9,70,12],[59,5,59,8],[71,1,73,2],[71,4,73,4],[71,5,71,8],[71,9,71,12],[73,5,73,8],[73,9,73,12],[59,9,59,12],[61,5,61,8],[61,9,61,12],[94,1,94,2],[94,5,94,8],[94,9,94,12],[76,5,76,8],[76,9,76,12],[77,5,77,8],[77,9,77,12],[79,5,79,8],[79,9,79,12],[80,5,80,8],[80,9,80,12],[82,5,82,8],[82,9,82,12],[77,3,79,3],[80,3,82,3],[86,1,88,2],[80,4,82,4],[95,1,95,2],[95,5,95,8],[95,9,95,12],[97,1,97,4],[98,1,98,13],[86,9,86,12],[88,5,88,8],[88,9,88,12],[85,5,85,8],[85,9,85,12],[89,1,91,2],[89,4,91,4],[89,5,89,8],[89,9,89,12],[91,5,91,8],[91,9,91,12],[89,3,91,3],[86,4,88,4],[86,5,86,8],[86,3,88,3],[83,1,85,2],[83,4,85,4],[83,5,83,8],[83,9,83,12],[68,5,68,8],[65,5,65,8],[65,9,65,12],[67,5,67,8],[67,9,67,12],[65,3,67,3],[62,9,62,12],[64,5,64,8],[64,9,64,12],[62,5,62,8],[53,9,53,12],[55,5,55,8],[55,9,55,12],[50,5,50,8],[50,9,50,12],[52,5,52,8],[52,9,52,12],[56,9,56,12],[58,5,58,8],[58,9,58,12],[53,5,53,8],[56,5,56,8],[44,9,44,12],[46,5,46,8],[46,9,46,12],[47,1,49,2],[47,4,49,4],[47,5,47,8],[47,9,47,12],[49,5,49,8],[49,9,49,12],[44,5,44,8],[47,3,49,3],[35,9,35,12],[37,5,37,8],[37,9,37,12],[35,3,37,3],[40,9,40,12],[38,3,40,3],[38,9,38,12],[41,1,43,2],[41,4,43,4],[41,5,41,8],[41,9,41,12],[43,5,43,8],[43,9,43,12],[41,3,43,3],[35,5,35,8],[38,5,38,8],[40,5,40,8],[29,9,29,12],[31,5,31,8],[31,9,31,12],[32,1,34,2],[32,4,34,4],[32,5,32,8],[32,9,32,12],[34,5,34,8],[34,9,34,12],[32,3,34,3],[29,5,29,8],[29,1,31,2],[29,4,31,4],[26,1,28,2],[26,4,28,4],[26,5,26,8],[26,9,26,12],[28,5,28,8],[28,9,28,12],[23,3,25,3],[23,1,25,2],[23,4,25,4],[23,5,23,8],[26,3,28,3],[14,3,16,3],[17,3,19,3],[14,4,16,4],[14,5,14,8],[14,9,14,12],[16,5,16,8],[16,9,16,12],[23,9,23,12],[25,5,25,8],[25,9,25,12],[17,9,17,12],[19,5,19,8],[19,9,19,12],[20,1,22,2],[20,4,22,4],[20,5,20,8],[20,9,20,12],[22,5,22,8],[22,9,22,12],[20,3,22,3],[83,3,85,3],[53,4,55,4],[59,1,61,2],[59,4,61,4],[74,1,76,2],[77,1,79,2],[77,4,79,4],[80,1,82,2],[65,1,67,2],[68,3,70,3],[62,3,64,3],[68,1,70,2],[56,3,58,3],[65,4,67,4],[71,3,73,3],[74,3,76,3],[74,4,76,4],[56,1,58,2],[68,4,70,4],[44,3,46,3],[62,1,64,2],[62,4,64,4],[38,1,40,2],[38,4,40,4],[59,3,61,3],[44,1,46,2],[44,4,46,4],[53,1,55,2],[50,1,52,2],[50,4,52,4],[10,1,10,13],[9,8,9,13],[8,8,8,13],[3,8,3,13],[6,8,6,13],[5,8,5,13],[3,1,3,7],[56,4,58,4],[29,3,31,3],[35,1,37,2],[35,4,37,4],[50,3,52,3],[53,3,55,3],[12,13,13,13],[13,1,13,2],[13,5,13,8],[13,9,13,12],[12,3,13,3],[12,9,12,12],[14,1,16,2],[12,5,12,8],[17,1,19,2],[17,4,19,4],[17,5,17,8]]}
[]
[]
[null,"UNIDADE ESCOLAR",null,null,null,null,null,null,"PRAZO"]
[null,{"$f":"Orçamento!$O$4","v":"CENTRO DE ATENDIMENTO EDUCACIONAL ESPECIALIZADO DE IPORÁ"},null,null,null,null,null,null,"60 DIAS CORRIDOS"]
[]
[null,"OBRA",null,null,null,null,null,null,"DATA"]
[null,{"$f":"Orçamento!$O$7","v":"REFORMA"},null,null,null,null,null,null,{"$f":"Orçamento!$S$7","v":"2020-04-06"}]
[]
[null,"LOCAL",null,null,null,null,null,null,"ÁREA TOTAL CONSTRUÍDA (M²)"]
["FILTRO",{"$f":"Orçamento!$V$7","v":"IPORÁ"},null,null,null,null,null,null,{"$f":"Orçamento!$V$13","v":643.09999999999991}]
[]
[null,"CRONOGRAMA - FÍSICO FINANCEIRO"]
["↓","CUSTO TOTAL:",{"$f":"D93","v":0},"VALOR","Dias:",30,null,null,null,60,null,null,null,"TOTAL"]
[null,"DESCRIÇÃO DOS SERVIÇOS",null,null,"%","1ª PARCELA",null,null,null,"2ª PARCELA"]
[{"$f":"IF(D15>0,\"F\",\"\")","v":""},"SERVIÇOS PRELIMINARES",null,{"$f":"Orçamento!V338","v":0},{"$f":"Orçamento!X338","v":0},{"$f":"ROUND(F17*$D$15,2)","v":0},null,null,null,{"$f":"ROUND(J17*$D$15,2)","v":0},null,null,null,{"$f":"SUM(F15:M15)","v":0},null,{"$f":"IF(D15=N15,\"OK\",\"ERRO\")","v":"OK"}]
[{"$f":"IF(A15=\"F\",A15,\"\")","v":""}]
[{"$f":"IF(A16=\"F\",A16,\"\")","v":""},null,null,null,null,1,null,null,null,{"$f":"1-F17","v":0},null,null,null,{"$f":"IFERROR(E15/100,\"\")","v":0},null,{"$f":"IF(E15=N17*100,\"OK\",\"ERRO\")","v":"OK"}]
[{"$f":"IF(D18>0,\"F\",\"\")","v":""},"TRANSPORTES",null,{"$f":"Orçamento!V339","v":0},{"$f":"Orçamento!X339","v":0},{"$f":"ROUND(F20*$D$18,2)","v":0},null,null,null,{"$f":"ROUND(J20*$D$18,2)","v":0},null,null,null,{"$f":"SUM(F18:M18)","v":0},null,{"$f":"IF(D18=N18,\"OK\",\"ERRO\")","v":"OK"}]
[{"$f":"IF(A18=\"F\",A18,\"\")","v":""}]
[{"$f":"IF(A19=\"F\",A19,\"\")","v":""},null,null,null,null,0.48,null,null,null,{"$f":"1-F20","v":0.52},null,null,null,{"$f":"IFERROR(E18/100,\"\")","v":0},null,{"$f":"IF(E18=N20*100,\"OK\",\"ERRO\")","v":"OK"}]
[{"$f":"IF(D21>0,\"F\",\"\")","v":""},"SERVIÇO EM TERRA",null,{"$f":"Orçamento!V340","v":0},{"$f":"Orçamento!X340","v":0},{"$f":"ROUND(F23*$D$21,2)","v":0},null,null,null,{"$f":"ROUND(J23*$D$21,2)","v":0},null,null,null,{"$f":"SUM(F21:M21)","v":0},null,{"$f":"IF(D21=N21,\"OK\",\"ERRO\")","v":"OK"}]
[{"$f":"IF(A21=\"F\",A21,\"\")","v":""}]
[{"$f":"IF(A22=\"F\",A22,\"\")","v":""},null,null,null,null,1,null,null,null,{"$f":"1-F23","v":0},null,null,null,{"$f":"IFERROR(E21/100,\"\")","v":0},null,{"$f":"IF(E21=N23*100,\"OK\",\"ERRO\")","v":"OK"}]
[{"$f":"IF(D24>0,\"F\",\"\")","v":""},"FUNDAÇÕES E SONDAGENS",null,{"$f":"Orçamento!V341","v":0},{"$f":"Orçamento!X341","v":0},{"$f":"ROUND(F26*$D$24,2)","v":0},null,null,null,{"$f":"ROUND(J26*$D$24,2)","v":0},null,null,null,{"$f":"SUM(F24:M24)","v":0},null,{"$f":"IF(D24=N24,\"OK\",\"ERRO\")","v":"OK"}]
[{"$f":"IF(A24=\"F\",A24,\"\")","v":""}]
[{"$f":"IF(A25=\"F\",A25,\"\")","v":""},null,null,null,null,1,null,null,null,{"$f":"1-F26","v":0},null,null,null,{"$f":"IFERROR(E24/100,\"\")","v":0},null,{"$f":"IF(E24=N26*100,\"OK\",\"ERRO\")","v":"OK"}]
[{"$f":"IF(D27>0,\"F\",\"\")","v":""},"ESTRUTURA",null,{"$f":"Orçamento!V342","v":0},{"$f":"Orçamento!X342","v":0},{"$f":"ROUND(F29*$D$27,2)","v":0},null,null,null,{"$f":"ROUND(J29*$D$27,2)","v":0},null,null,null,{"$f":"SUM(F27:M27)","v":0},null,{"$f":"IF(D27=N27,\"OK\",\"ERRO\")","v":"OK"}]
[{"$f":"IF(A27=\"F\",A27,\"\")","v":""}]
[{"$f":"IF(A28=\"F\",A28,\"\")","v":""},null,null,null,null,0.49,null,null,null,{"$f":"1-F29","v":0.51},null,null,null,{"$f":"IFERROR(E27/100,\"\")","v":0},null,{"$f":"IF(E27=N29*100,\"OK\",\"ERRO\")","v":"OK"}]
[{"$f":"IF(D30>0,\"F\",\"\")","v":""},"INST.ELET/TELEFÔNICA/CABEAMENTO ESTRUTURADO",null,{"$f":"Orçamento!V343","v":0},{"$f":"Orçamento!X343","v":0},{"$f":"ROUND(F32*$D$30,2)","v":0},null,null,null,{"$f":"ROUND(J32*$D$30,2)","v":0},null,null,null,{"$f":"SUM(F30:M30)","v":0},null,{"$f":"IF(D30=N30,\"OK\",\"ERRO\")","v":"OK"}]
[{"$f":"IF(A30=\"F\",A30,\"\")","v":""}]
[{"$f":"IF(A31=\"F\",A31,\"\")","v":""},null,null,null,null,0.4,null,null,null,{"$f":"1-F32","v":0.6},null,null,null,{"$f":"IFERROR(E30/100,\"\")","v":0},null,{"$f":"IF(E30=N32*100,\"OK\",\"ERRO\")","v":"OK"}]
[{"$f":"IF(D33>0,\"F\",\"\")","v":""},"INSTALAÇÕES HIDROSSANITÁRIAS",null,{"$f":"Orçamento!V344","v":0},{"$f":"Orçamento!X344","v":0},{"$f":"ROUND(F35*$D$33,2)","v":0},null,null,null,{"$f":"ROUND(J35*$D$33,2)","v":0},null,null,null,{"$f":"SUM(F33:M33)","v":0},null,{"$f":"IF(D33=N33,\"OK\",\"ERRO\")","v":"OK"}]
[{"$f":"IF(A33=\"F\",A33,\"\")","v":""}]
[{"$f":"IF(A34=\"F\",A34,\"\")","v":""},null,null,null,null,0.48,null,null,null,{"$f":"1-F35","v":0.52},null,null,null,{"$f":"IFERROR(E33/100,\"\")","v":0},null,{"$f":"IF(E33=N35*100,\"OK\",\"ERRO\")","v":"OK"}]
[{"$f":"IF(D36>0,\"F\",\"\")","v":""},"INSTALAÇÕES ESPECIAIS",null,{"$f":"Orçamento!V345","v":0},{"$f":"Orçamento!X345","v":0},{"$f":"ROUND(F38*$D$36,2)","v":0},null,null,null,{"$f":"ROUND(J38*$D$36,2)","v":0},null,null,null,{"$f":"SUM(F36:M36)","v":0},null,{"$f":"IF(D36=N36,\"OK\",\"ERRO\")","v":"OK"}]
[{"$f":"IF(A36=\"F\",A36,\"\")","v":""}]
[{"$f":"IF(A37=\"F\",A37,\"\")","v":""},null,null,null,null,1,null,null,null,{"$f":"1-F38","v":0},null,null,null,{"$f":"IFERROR(E36/100,\"\")","v":0},null,{"$f":"IF(E36=N38*100,\"OK\",\"ERRO\")","v":"OK"}]
[{"$f":"IF(D39>0,\"F\",\"\")","v":""},"ALVENARIA E DIVISÓRIAS",null,{"$f":"Orçamento!V346","v":0},{"$f":"Orçamento!X346","v":0},{"$f":"ROUND(F41*$D$39,2)","v":0},null,null,null,{"$f":"ROUND(J41*$D$39,2)","v":0},null,null,null,{"$f":"SUM(F39:M39)","v":0},null,{"$f":"IF(D39=N39,\"OK\",\"ERRO\")","v":"OK"}]
[{"$f":"IF(A39=\"F\",A39,\"\")","v":""}]
[{"$f":"IF(A40=\"F\",A40,\"\")","v":""},null,null,null,null,1,null,null,null,{"$f":"1-F41","v":0},null,null,null,{"$f":"IFERROR(E39/100,\"\")","v":0},null,{"$f":"IF(E39=N41*100,\"OK\",\"ERRO\")","v":"OK"}]
[{"$f":"IF(D42>0,\"F\",\"\")","v":""},"ALVENARIA AUTO-PORTANTE",null,{"$f":"Orçamento!V347","v":0},{"$f":"Orçamento!X347","v":0},{"$f":"ROUND(F44*$D$42,2)","v":0},null,null,null,{"$f":"ROUND(J44*$D$42,2)","v":0},null,null,null,{"$f":"SUM(F42:M42)","v":0},null,{"$f":"IF(D42=N42,\"OK\",\"ERRO\")","v":"OK"}]
[{"$f":"IF(A42=\"F\",A42,\"\")","v":""}]
[{"$f":"IF(A43=\"F\",A43,\"\")","v":""},null,null,null,null,1,null,null,null,{"$f":"1-F44","v":0},null,null,null,{"$f":"IFERROR(E42/100,\"\")","v":0},null,{"$f":"IF(E42=N44*100,\"OK\",\"ERRO\")","v":"OK"}]
[{"$f":"IF(D45>0,\"F\",\"\")","v":""},"IMPERMEABILIZAÇÃO",null,{"$f":"Orçamento!V348","v":0},{"$f":"Orçamento!X348","v":0},{"$f":"ROUND(F47*$D$45,2)","v":0},null,null,null,{"$f":"ROUND(J47*$D$45,2)","v":0},null,null,null,{"$f":"SUM(F45:M45)","v":0},null,{"$f":"IF(D45=N45,\"OK\",\"ERRO\")","v":"OK"}]
[{"$f":"IF(A45=\"F\",A45,\"\")","v":""}]
[{"$f":"IF(A46=\"F\",A46,\"\")","v":""},null,null,null,null,1,null,null,null,{"$f":"1-F47","v":0},null,null,null,{"$f":"IFERROR(E45/100,\"\")","v":0},null,{"$f":"IF(E45=N47*100,\"OK\",\"ERRO\")","v":"OK"}]
[{"$f":"IF(D48>0,\"F\",\"\")","v":""},"ISOLAMENTO TÉRMICO E ACÚSTICO",null,{"$f":"Orçamento!V349","v":0},{"$f":"Orçamento!X349","v":0},{"$f":"ROUND(F50*$D$48,2)","v":0},null,null,null,{"$f":"ROUND(J50*$D$48,2)","v":0},null,null,null,{"$f":"SUM(F48:M48)","v":0},null,{"$f":"IF(D48=N48,\"OK\",\"ERRO\")","v":"OK"}]
[{"$f":"IF(A48=\"F\",A48,\"\")","v":""}]
[{"$f":"IF(A49=\"F\",A49,\"\")","v":""},null,null,null,null,0.5,null,null,null,{"$f":"1-F50","v":0.5},null,null,null,{"$f":"IFERROR(E48/100,\"\")","v":0},null,{"$f":"IF(E48=N50*100,\"OK\",\"ERRO\")","v":"OK"}]
[{"$f":"IF(D51>0,\"F\",\"\")","v":""},"ESTRUTURA DE MADEIRA",null,{"$f":"Orçamento!V350","v":0},{"$f":"Orçamento!X350","v":0},{"$f":"ROUND(F53*$D$51,2)","v":0},null,null,null,{"$f":"ROUND(J53*$D$51,2)","v":0},null,null,null,{"$f":"SUM(F51:M51)","v":0},null,{"$f":"IF(D51=N51,\"OK\",\"ERRO\")","v":"OK"}]
[{"$f":"IF(A51=\"F\",A51,\"\")","v":""}]
[{"$f":"IF(A52=\"F\",A52,\"\")","v":""},null,null,null,null,0.4,null,null,null,{"$f":"1-F53","v":0.6},null,null,null,{"$f":"IFERROR(E51/100,\"\")","v":0},null,{"$f":"IF(E51=N53*100,\"OK\",\"ERRO\")","v":"OK"}]
[{"$f":"IF(D54>0,\"F\",\"\")","v":""},"ESTRUTURA METÁLICA",null,{"$f":"Orçamento!V351","v":0},{"$f":"Orçamento!X351","v":0},{"$f":"ROUND(F56*$D$54,2)","v":0},null,null,null,{"$f":"ROUND(J56*$D$54,2)","v":0},null,null,null,{"$f":"SUM(F54:M54)","v":0},null,{"$f":"IF(D54=N54,\"OK\",\"ERRO\")","v":"OK"}]
[{"$f":"IF(A54=\"F\",A54,\"\")","v":""}]
[{"$f":"IF(A55=\"F\",A55,\"\")","v":""},null,null,null,null,0.35,null,null,null,{"$f":"1-F56","v":0.65},null,null,null,{"$f":"IFERROR(E54/100,\"\")","v":0},null,{"$f":"IF(E54=N56*100,\"OK\",\"ERRO\")","v":"OK"}]
[{"$f":"IF(D57>0,\"F\",\"\")","v":""},"COBERTURAS",null,{"$f":"Orçamento!V352","v":0},{"$f":"Orçamento!X352","v":0},{"$f":"ROUND(F59*$D$57,2)","v":0},null,null,null,{"$f":"ROUND(J59*$D$57,2)","v":0},null,null,null,{"$f":"SUM(F57:M57)","v":0},null,{"$f":"IF(D57=N57,\"OK\",\"ERRO\")","v":"OK"}]
[{"$f":"IF(A57=\"F\",A57,\"\")","v":""}]
[{"$f":"IF(A58=\"F\",A58,\"\")","v":""},null,null,null,null,0,null,null,null,{"$f":"1-F59","v":1},null,null,null,{"$f":"IFERROR(E57/100,\"\")","v":0},null,{"$f":"IF(E57=N59*100,\"OK\",\"ERRO\")","v":"OK"}]
[{"$f":"IF(D60>0,\"F\",\"\")","v":""},"ESQUADRIAS DE MADEIRA",null,{"$f":"Orçamento!V353","v":0},{"$f":"Orçamento!X353","v":0},{"$f":"ROUND(F62*$D$60,2)","v":0},null,null,null,{"$f":"ROUND(J62*$D$60,2)","v":0},null,null,null,{"$f":"SUM(F60:M60)","v":0},null,{"$f":"IF(D60=N60,\"OK\",\"ERRO\")","v":"OK"}]
[{"$f":"IF(A60=\"F\",A60,\"\")","v":""}]
[{"$f":"IF(A61=\"F\",A61,\"\")","v":""},null,null,null,null,0.54,null,null,null,{"$f":"1-F62","v":0.45999999999999996},null,null,null,{"$f":"IFERROR(E60/100,\"\")","v":0},null,{"$f":"IF(E60=N62*100,\"OK\",\"ERRO\")","v":"OK"}]
[{"$f":"IF(D63>0,\"F\",\"\")","v":""},"ESQUADRIAS METÁLICAS",null,{"$f":"Orçamento!V354","v":0},{"$f":"Orçamento!X354","v":0},{"$f":"ROUND(F65*$D$63,2)","v":0},null,null,null,{"$f":"ROUND(J65*$D$63,2)","v":0},null,null,null,{"$f":"SUM(F63:M63)","v":0},null,{"$f":"IF(D63=N63,\"OK\",\"ERRO\")","v":"OK"}]
[{"$f":"IF(A63=\"F\",A63,\"\")","v":""}]
[{"$f":"IF(A64=\"F\",A64,\"\")","v":""},null,null,null,null,0.49,null,null,null,{"$f":"1-F65","v":0.51},null,null,null,{"$f":"IFERROR(E63/100,\"\")","v":0},null,{"$f":"IF(E63=N65*100,\"OK\",\"ERRO\")","v":"OK"}]
[{"$f":"IF(D66>0,\"F\",\"\")","v":""},"VIDROS",null,{"$f":"Orçamento!V355","v":0},{"$f":"Orçamento!X355","v":0},{"$f":"ROUND(F68*$D$66,2)","v":0},null,null,null,{"$f":"ROUND(J68*$D$66,2)","v":0},null,null,null,{"$f":"SUM(F66:M66)","v":0},null,{"$f":"IF(D66=N66,\"OK\",\"ERRO\")","v":"OK"}]
[{"$f":"IF(A66=\"F\",A66,\"\")","v":""}]
[{"$f":"IF(A67=\"F\",A67,\"\")","v":""},null,null,null,null,0,null,null,null,{"$f":"1-F68","v":1},null,null,null,{"$f":"IFERROR(E66/100,\"\")","v":0},null,{"$f":"IF(E66=N68*100,\"OK\",\"ERRO\")","v":"OK"}]
[{"$f":"IF(D69>0,\"F\",\"\")","v":""},"REVESTIMENTO DE PAREDE",null,{"$f":"Orçamento!V356","v":0},{"$f":"Orçamento!X356","v":0},{"$f":"ROUND(F71*$D$69,2)","v":0},null,null,null,{"$f":"ROUND(J71*$D$69,2)","v":0},null,null,null,{"$f":"SUM(F69:M69)","v":0},null,{"$f":"IF(D69=N69,\"OK\",\"ERRO\")","v":"OK"}]
[{"$f":"IF(A69=\"F\",A69,\"\")","v":""}]
[{"$f":"IF(A70=\"F\",A70,\"\")","v":""},null,null,null,null,0.32,null,null,null,{"$f":"1-F71","v":0.67999999999999994},null,null,null,{"$f":"IFERROR(E69/100,\"\")","v":0},null,{"$f":"IF(E69=N71*100,\"OK\",\"ERRO\")","v":"OK"}]
[{"$f":"IF(D72>0,\"F\",\"\")","v":""},"FORROS",null,{"$f":"Orçamento!V357","v":0},{"$f":"Orçamento!X357","v":0},{"$f":"ROUND(F74*$D$72,2)","v":0},null,null,null,{"$f":"ROUND(J74*$D$72,2)","v":0},null,null,null,{"$f":"SUM(F72:M72)","v":0},null,{"$f":"IF(D72=N72,\"OK\",\"ERRO\")","v":"OK"}]
[{"$f":"IF(A72=\"F\",A72,\"\")","v":""}]
[{"$f":"IF(A73=\"F\",A73,\"\")","v":""},null,null,null,null,0.24,null,null,null,{"$f":"1-F74","v":0.76},null,null,null,{"$f":"IFERROR(E72/100,\"\")","v":0},null,{"$f":"IF(E72=N74*100,\"OK\",\"ERRO\")","v":"OK"}]
[{"$f":"IF(D75>0,\"F\",\"\")","v":""},"REVESTIMENTO DE PISO",null,{"$f":"Orçamento!V358","v":0},{"$f":"Orçamento!X358","v":0},{"$f":"ROUND(F77*$D$75,2)","v":0},null,null,null,{"$f":"ROUND(J77*$D$75,2)","v":0},null,null,null,{"$f":"SUM(F75:M75)","v":0},null,{"$f":"IF(D75=N75,\"OK\",\"ERRO\")","v":"OK"}]
[{"$f":"IF(A75=\"F\",A75,\"\")","v":""}]
[{"$f":"IF(A76=\"F\",A76,\"\")","v":""},null,null,null,null,0.49,null,null,null,{"$f":"1-F77","v":0.51},null,null,null,{"$f":"IFERROR(E75/100,\"\")","v":0},null,{"$f":"IF(E75=N77*100,\"OK\",\"ERRO\")","v":"OK"}]
[{"$f":"IF(D78>0,\"F\",\"\")","v":""},"FERRAGENS",null,{"$f":"Orçamento!V359","v":0},{"$f":"Orçamento!X359","v":0},{"$f":"ROUND(F80*$D$78,2)","v":0},null,null,null,{"$f":"ROUND(J80*$D$78,2)","v":0},null,null,null,{"$f":"SUM(F78:M78)","v":0},null,{"$f":"IF(D78=N78,\"OK\",\"ERRO\")","v":"OK"}]
[{"$f":"IF(A78=\"F\",A78,\"\")","v":""}]
[{"$f":"IF(A79=\"F\",A79,\"\")","v":""},null,null,null,null,0,null,null,null,{"$f":"1-F80","v":1},null,null,null,{"$f":"IFERROR(E78/100,\"\")","v":0},null,{"$f":"IF(E78=N80*100,\"OK\",\"ERRO\")","v":"OK"}]
[{"$f":"IF(D81>0,\"F\",\"\")","v":""},"MARCENARIA",null,{"$f":"Orçamento!V360","v":0},{"$f":"Orçamento!X360","v":0},{"$f":"ROUND(F83*$D$81,2)","v":0},null,null,null,{"$f":"ROUND(J83*$D$81,2)","v":0},null,null,null,{"$f":"SUM(F81:M81)","v":0},null,{"$f":"IF(D81=N81,\"OK\",\"ERRO\")","v":"OK"}]
[{"$f":"IF(A81=\"F\",A81,\"\")","v":""}]
[{"$f":"IF(A82=\"F\",A82,\"\")","v":""},null,null,null,null,0.4,null,null,null,{"$f":"1-F83","v":0.6},null,null,null,{"$f":"IFERROR(E81/100,\"\")","v":0},null,{"$f":"IF(E81=N83*100,\"OK\",\"ERRO\")","v":"OK"}]
[{"$f":"IF(D84>0,\"F\",\"\")","v":""},"ADMINISTRAÇÃO - MENSALISTAS",null,{"$f":"Orçamento!V361","v":0},{"$f":"Orçamento!X361","v":0},{"$f":"ROUND(F86*$D$84,2)","v":0},null,null,null,{"$f":"ROUND(J86*$D$84,2)","v":0},null,null,null,{"$f":"SUM(F84:M84)","v":0},null,{"$f":"IF(D84=N84,\"OK\",\"ERRO\")","v":"OK"}]
[{"$f":"IF(A84=\"F\",A84,\"\")","v":""}]
[{"$f":"IF(A85=\"F\",A85,\"\")","v":""},null,null,null,null,0.49,null,null,null,{"$f":"1-F86","v":0.51},null,null,null,{"$f":"IFERROR(E84/100,\"\")","v":0},null,{"$f":"IF(E84=N86*100,\"OK\",\"ERRO\")","v":"OK"}]
[{"$f":"IF(D87>0,\"F\",\"\")","v":""},"PINTURA",null,{"$f":"Orçamento!V362","v":0},{"$f":"Orçamento!X362","v":0},{"$f":"ROUND(F89*$D$87,2)","v":0},null,null,null,{"$f":"ROUND(J89*$D$87,2)","v":0},null,null,null,{"$f":"SUM(F87:M87)","v":0},null,{"$f":"IF(D87=N87,\"OK\",\"ERRO\")","v":"OK"}]
[{"$f":"IF(A87=\"F\",A87,\"\")","v":""}]
[{"$f":"IF(A88=\"F\",A88,\"\")","v":""},null,null,null,null,0,null,null,null,{"$f":"1-F89","v":1},null,null,null,{"$f":"IFERROR(E87/100,\"\")","v":0},null,{"$f":"IF(E87=N89*100,\"OK\",\"ERRO\")","v":"OK"}]
[{"$f":"IF(D90>0,\"F\",\"\")","v":""},"DIVERSOS",null,{"$f":"Orçamento!V363","v":0},{"$f":"Orçamento!X363","v":0},{"$f":"ROUND(F92*$D$90,2)","v":0},null,null,null,{"$f":"ROUND(J92*$D$90,2)","v":0},null,null,null,{"$f":"SUM(F90:M90)","v":0},null,{"$f":"IF(D90=N90,\"OK\",\"ERRO\")","v":"OK"}]
[{"$f":"IF(A90=\"F\",A90,\"\")","v":""}]
[{"$f":"IF(A91=\"F\",A91,\"\")","v":""},null,null,null,null,0.46,null,null,null,{"$f":"1-F92","v":0.54},null,null,null,{"$f":"IFERROR(E90/100,\"\")","v":0},null,{"$f":"IF(E90=N92*100,\"OK\",\"ERRO\")","v":"OK"}]
["F","CUSTO DO ORÇAMENTO",null,{"$f":"SUM(D15:D92)","v":0},{"$f":"SUM(E15:E92)","v":0},{"$f":"F15+F18+F21+F24+F27+F30+F33+F36+F39+F42+F45+F48+F51+F54+F57+F60+F63+F66+F69+F72+F75+F78+F81+F84+F87+F90","v":0},null,null,null,{"$f":"J15+J18+J21+J24+J27+J30+J33+J36+J39+J42+J45+J48+J51+J54+J57+J60+J63+J66+J69+J72+J75+J78+J81+J84+J87+J90","v":0},null,null,null,{"$f":"N15+N18+N21+N24+N27+N30+N33+N36+N39+N42+N45+N48+N51+N54+N57+N60+N63+N66+N69+N72+N75+N78+N81+N84+N87+N90","v":0}]
["F","PERCENTUAIS:",null,null,null,{"$f":"IFERROR(F93/D93,\"\")","v":""},null,null,null,{"$f":"IFERROR(J93/D93,\"\")","v":""},null,null,null,{"$f":"SUM(F94:M94)","v":0}]
["F","TOTAIS ACUMULADOS:",null,null,null,{"$f":"F93","v":0},null,null,null,{"$f":"F95+J93","v":0}]
["F","PERCENTUAIS  ACUMULADOS:",null,null,null,{"$f":"F94","v":""},null,null,null,{"$f":"IFERROR(F96+J94,\"\")","v":""}]
["F"]
["F","OBSERVAÇÕES:"]
["F","Os pagamentos somente poderão ser efetuados mediante medição e atesto pelos técnicos da Secretaria da Educação. "]

{"sheet":"Composição BDI","index":4,"n_rows":45,"n_cols":9,"rows_kept":45,"cut":false,"hidden":false,"merged":[[11,0,11,3],[12,0,12,3],[14,0,14,3],[15,0,15,3],[13,0,13,3],[0,0,0,3],[1,0,1,3],[4,0,4,3],[7,0,7,3],[10,0,10,3],[2,0,2,3],[3,0,3,3],[5,0,5,3],[6,0,6,3],[8,0,8,3],[9,0,9,3],[18,5,18,8],[17,0,17,3],[16,0,16,3],[44,0,44,3],[42,0,42,3],[43,0,43,3],[18,0,18,3],[36,0,36,3],[39,0,39,3],[38,0,38,3],[40,0,40,3],[29,0,29,2],[32,0,32,3],[33,0,33,3],[34,0,34,3],[35,0,35,3]]}
[]
[]
["UNIDADE ESCOLAR"]
[{"$f":"Orçamento!$O$4","v":"CENTRO DE ATENDIMENTO EDUCACIONAL ESPECIALIZADO DE IPORÁ"}]
[]
["OBRA"]
[{"$f":"Orçamento!$O$7","v":"REFORMA"}]
[null,null,null,null,null,null,null,"DESONERADA"]
["ENDEREÇO"]
[{"$f":"Orçamento!$R$10","v":"AV DR NETO ESQ. C/ RUA GOIÂNIA S/N, CENTRO, CEP:76200-000"}]
[]
["CIDADE"]
[{"$f":"Orçamento!$V$7","v":"IPORÁ"}]
[]
["CRE"]
[{"$f":"Orçamento!$O$10","v":"IPORÁ"}]
[]
["DETALHAMENTO DA COMPOSIÇÃO DE BDI"]
["COMPOSIÇÃO BDI PARA OBRAS CIVIS",null,null,null,null,"BDI CONSTRUÇÃO E REFORMA"]
["DESCRIÇÃO","COEF.","TAXA % (a.m)","% no preço de venda",null,"Situação","1º Quartil","Médio","3º Quartil"]
["1) COFINS",1,0.03,{"$f":"C21","v":0.03},null,{"$f":"IF(OR(C21<G21,C21>I21),\"FORA DO INTERVALO\",\"OK\")","v":"OK"},0.03,0.03,0.03]
["2) PIS",1,6.4999999999999997E-3,{"$f":"C22","v":6.4999999999999997E-3},null,{"$f":"IF(OR(C22<G22,C22>I22),\"FORA DO INTERVALO\",\"OK\")","v":"OK"},6.4999999999999997E-3,6.4999999999999997E-3,6.4999999999999997E-3]
["3) ISSQN",1,2.5000000000000001E-2,{"$f":"C23*B23","v":2.5000000000000001E-2},null,"OK",0.02,3.5000000000000003E-2,0.05]
["4) CPRB",1,4.4999999999999998E-2,{"$f":"C24","v":4.4999999999999998E-2},null,"OK",4.4999999999999998E-2,4.4999999999999998E-2,4.4999999999999998E-2]
["5) Administração Central",1,0.04,0.04,null,"OK",0.03,0.04,5.5E-2]
["6) Despesas Financeiras",1,5.5999999999999999E-3,5.5999999999999999E-3,null,"FORA DO INTERVALO",5.8999999999999999E-3,1.23E-2,1.3899999999999999E-2]
["7) Seguros + Garantias",1,1.1999999999999999E-3,1.1999999999999999E-3,null,"FORA DO INTERVALO",8.0000000000000002E-3,8.0000000000000002E-3,0.01]
["8) Risco",1,9.7000000000000003E-3,9.7000000000000003E-3,null,"OK",9.7000000000000003E-3,1.2699999999999999E-2,1.2699999999999999E-2]
["9) Lucro",1,6.8699999999999997E-2,6.8699999999999997E-2,null,"OK",6.1600000000000002E-2,7.3999999999999996E-2,8.9599999999999999E-2]
["BDI - FINAL",null,null,{"$f":"(((1+D25+D27+D28)*(1+D26)*(1+D29))/(1-(D21+D22+D23+D24))-1)","v":0.26400243116731992},null,{"$f":"IF(OR(D30<G30,D30>I30),\"FORA DO INTERVALO\",\"OK\")","v":"FORA DO INTERVALO"},0.2034,0.22120000000000001,0.25]
[]
["Notas:"]
["(1) e (2) Alíquota definida por lei."]
["(3) Alíquota e base de cálculo definidas pela legislação municipal."]
["(4) Alíquota definida pelas leis 12.546/11, 12844/13 e 13.161/15 (CPRB – contribuição previdenciária sobre a receita bruta)."]
["(5) Valores definidos a partir dos limites no Acórdão nº 2.622/2013 - TCU – Plenário. Valores entre o 1º e 3º quartis."]
["(6) Valor calculado pela expressão matemática do acórdão 2.369/2011 – TCU – Plenário e disponibilizado pela AGETOP em dezembro de 2018. (Foi utilizado para o cálculo a média da Taxa SELIC no período de 11/2017 a 10/2018)"]
[]
["(7) Valores definidos pela AGETOP a partir dos limites no Acórdão nº 2.622/2013 - TCU – Plenário. Valores médios. \n\nObservação da AGETOP: (Seguros contra erros de execução, incêndio e explosão, danos da natureza (vendaval, destelhamento, alagamento, inundação, desmoronamento, geadas etc.), emprego de material defeituoso ou inadequado, roubo e/ou furto qualificado, quebra de equipamentos, desmoronamento de estrutura, nas modalidades de Obras Civis em Construção (OCC); Instalação e Montagem (IM); e Obras Civis em Construção e Instalação e Montagem (OCC/IM). Bem como coberturas adicionais para ampliação dessas coberturas básicas, como: cobertura de responsabilidade civil geral, cobertura de responsabilidade civil cruzada, cobertura de despesas extraordinárias, cobertura de tumultos, cobertura de desentulho do local, cobertura de riscos do fabricante, dentre outras, incluindo o seguro de vida em grupo regido pela convenção coletiva dos trabalhadores na indústria da construção civil). A partir de 24/02/2015 por intermédio da Portaria 449/2015 a Presidência da AGETOP, na pessoa do Senhor Jayme Eduardo Rincon, determinou a exclusão dos valores referentes aos Seguros de Risco de Engenharia e Responsabilidade Civil do Profissional na composição do cálculo do B.D.I.."]
["(8) Valores definidos a partir dos limites no Acórdão nº 2.622/2013 - TCU – Plenário. Valores entre 1º e 3° quartis."]
["(9) Valores definidos a partir dos limites definidos no Acórdão nº 2.622/2013 - TCU – Plenário. Valores adotados e praticados no mercado ( “ ex ante ” ) ou aqueles entre os 1º e 3º quartis."]
[]
["(*) A fórmula para estipulação da taxa de BDI estimado adotado é a mesma que foi aplicada para a obtenção das tabelas contidas no Acórdão n. 2.622/2013 – TCUPlenário"]
[]
["Obs.: Para obras com valores superiores a R$ 20.000.000,00 sugere-se recalcular o BDI, dimensionando as taxas de administração central e lucro para patamares inferiores ao estipulado acima."]

{"sheet":"Relatório CENTRAL","index":5,"n_rows":40,"n_cols":8,"rows_kept":40,"cut":false,"hidden":false,"merged":[[0,1,0,4],[6,3,6,4],[9,3,9,4],[1,1,1,4],[2,1,2,2],[2,3,2,4],[3,1,3,2],[3,3,3,4],[4,1,4,4],[5,1,5,2],[5,3,5,4],[6,1,6,2],[7,1,7,4],[8,1,8,2],[8,3,8,4],[9,1,9,2],[10,1,10,4],[11,1,11,4],[39,1,39,2],[9,0,11,0]]}
[]
[]
[null,"UNIDADE ESCOLAR",null,"CIDADE"]
[null,{"$f":"Orçamento!$O$4","v":"CENTRO DE ATENDIMENTO EDUCACIONAL ESPECIALIZADO DE IPORÁ"},null,{"$f":"Orçamento!$V$7","v":"IPORÁ"}]
[]
[null,"OBRA",null,"CRE"]
[null,{"$f":"Orçamento!$O$7","v":"REFORMA"},null,{"$f":"Orçamento!$O$10","v":"IPORÁ"}]
[null,null,null,null,null,null,null,"DESONERADA"]
[null,"ENDEREÇO",null,"DATA"]
["FILTRO",{"$f":"Orçamento!$R$10","v":"AV DR NETO ESQ. C/ RUA GOIÂNIA S/N, CENTRO, CEP:76200-000"},null,{"$f":"Orçamento!$S$7","v":"2020-04-06"}]
[]
[null,"RELATÓRIO CENTRAL"]
["↓","CÓDIGO","ETAPA","PREÇO  (R$) C/ BDI","PARTIC  ( % )"]
[{"$f":"IF(D14>0,\"F\",\"\")","v":""},{"$f":"Orçamento!O338","v":"a."},{"$f":"Orçamento!P338","v":"SERVIÇOS PRELIMINARES"},{"$f":"Orçamento!V338","v":0},{"$f":"Orçamento!X338","v":0}]
[{"$f":"IF(D15>0,\"F\",\"\")","v":""},{"$f":"Orçamento!O339","v":"b."},{"$f":"Orçamento!P339","v":"TRANSPORTES"},{"$f":"Orçamento!V339","v":0},{"$f":"Orçamento!X339","v":0}]
["",{"$f":"Orçamento!O340","v":"c."},{"$f":"Orçamento!P340","v":"SERVIÇO EM TERRA"},{"$f":"Orçamento!V340","v":0},{"$f":"Orçamento!X340","v":0}]
["",{"$f":"Orçamento!O341","v":"d."},{"$f":"Orçamento!P341","v":"FUNDAÇÕES E SONDAGENS"},{"$f":"Orçamento!V341","v":0},{"$f":"Orçamento!X341","v":0}]
["",{"$f":"Orçamento!O342","v":"e."},{"$f":"Orçamento!P342","v":"ESTRUTURA"},{"$f":"Orçamento!V342","v":0},{"$f":"Orçamento!X342","v":0}]
["",{"$f":"Orçamento!O343","v":"f."},{"$f":"Orçamento!P343","v":"INSTALAÇÕES ELÉTRICAS"},{"$f":"Orçamento!V343","v":0},{"$f":"Orçamento!X343","v":0}]
["",{"$f":"Orçamento!O344","v":"g."},{"$f":"Orçamento!P344","v":"INSTALAÇÕES HIDROSSANITÁRIAS"},{"$f":"Orçamento!V344","v":0},{"$f":"Orçamento!X344","v":0}]
["",{"$f":"Orçamento!O345","v":"h"},{"$f":"Orçamento!P345","v":"INSTALAÇÕES ESPECIAIS"},{"$f":"Orçamento!V345","v":0},{"$f":"Orçamento!X345","v":0}]
["",{"$f":"Orçamento!O346","v":"i."},{"$f":"Orçamento!P346","v":"ALVENARIAS E DIVISÓRIAS"},{"$f":"Orçamento!V346","v":0},{"$f":"Orçamento!X346","v":0}]
["",{"$f":"Orçamento!O347","v":"j."},{"$f":"Orçamento!P347","v":"ALVENARIA AUTO-PORTANTE"},{"$f":"Orçamento!V347","v":0},{"$f":"Orçamento!X347","v":0}]
["",{"$f":"Orçamento!O348","v":"k."},{"$f":"Orçamento!P348","v":"IMPERMEABILIZAÇÃO"},{"$f":"Orçamento!V348","v":0},{"$f":"Orçamento!X348","v":0}]
["",{"$f":"Orçamento!O349","v":"l."},{"$f":"Orçamento!P349","v":"ISOLAMENTO TÉRMICO E ACÚSTICO"},{"$f":"Orçamento!V349","v":0},{"$f":"Orçamento!X349","v":0}]
["",{"$f":"Orçamento!O350","v":"m."},{"$f":"Orçamento!P350","v":"ESTRUTURA DE MADEIRA"},{"$f":"Orçamento!V350","v":0},{"$f":"Orçamento!X350","v":0}]
["",{"$f":"Orçamento!O351","v":"n."},{"$f":"Orçamento!P351","v":"ESTRUTURAS METÁLICAS"},{"$f":"Orçamento!V351","v":0},{"$f":"Orçamento!X351","v":0}]
["",{"$f":"Orçamento!O352","v":"o."},{"$f":"Orçamento!P352","v":"COBERTURAS"},{"$f":"Orçamento!V352","v":0},{"$f":"Orçamento!X352","v":0}]
["",{"$f":"Orçamento!O353","v":"p."},{"$f":"Orçamento!P353","v":"ESQUADRIAS DE MADEIRA"},{"$f":"Orçamento!V353","v":0},{"$f":"Orçamento!X353","v":0}]
["",{"$f":"Orçamento!O354","v":"q."},{"$f":"Orçamento!P354","v":"ESQUADRIAS METÁLICAS"},{"$f":"Orçamento!V354","v":0},{"$f":"Orçamento!X354","v":0}]
["",{"$f":"Orçamento!O355","v":"r."},{"$f":"Orçamento!P355","v":"VIDROS"},{"$f":"Orçamento!V355","v":0},{"$f":"Orçamento!X355","v":0}]
["",{"$f":"Orçamento!O356","v":"s."},{"$f":"Orçamento!P356","v":"REVESTIMENTO DE PAREDE"},{"$f":"Orçamento!V356","v":0},{"$f":"Orçamento!X356","v":0}]
["",{"$f":"Orçamento!O357","v":"t."},{"$f":"Orçamento!P357","v":"FORROS"},{"$f":"Orçamento!V357","v":0},{"$f":"Orçamento!X357","v":0}]
["",{"$f":"Orçamento!O358","v":"u."},{"$f":"Orçamento!P358","v":"REVESTIMENTO DE PISO"},{"$f":"Orçamento!V358","v":0},{"$f":"Orçamento!X358","v":0}]
["",{"$f":"Orçamento!O359","v":"v."},{"$f":"Orçamento!P359","v":"FERRAGENS"},{"$f":"Orçamento!V359","v":0},{"$f":"Orçamento!X359","v":0}]
["",{"$f":"Orçamento!O360","v":"w."},{"$f":"Orçamento!P360","v":"MARCENARIA"},{"$f":"Orçamento!V360","v":0},{"$f":"Orçamento!X360","v":0}]
["",{"$f":"Orçamento!O361","v":"x."},{"$f":"Orçamento!P361","v":"ADMINISTRAÇÃO"},{"$f":"Orçamento!V361","v":0},{"$f":"Orçamento!X361","v":0}]
["",{"$f":"Orçamento!O362","v":"y."},{"$f":"Orçamento!P362","v":"PINTURA"},{"$f":"Orçamento!V362","v":0},{"$f":"Orçamento!X362","v":0}]
["",{"$f":"Orçamento!O363","v":"z."},{"$f":"Orçamento!P363","v":"DIVERSOS"},{"$f":"Orçamento!V363","v":0},{"$f":"Orçamento!X363","v":0}]
["F","TOTAL GERAL DO ORÇAMENTO (R$) C/BDI",null,{"$f":"SUM(D14:D39)","v":0},{"$f":"SUM(E14:E39)","v":0}]

{"sheet":"Parc Maior Relev","index":6,"n_rows":35,"n_cols":8,"rows_kept":35,"cut":false,"hidden":false,"merged":[[35,3,35,7],[33,1,33,6],[0,1,0,6],[11,1,11,6],[1,1,1,6],[2,1,2,3],[2,4,2,6],[3,1,3,3],[3,4,3,6],[4,1,4,6],[5,1,5,3],[5,4,5,6],[9,1,9,3],[9,4,9,6],[10,1,10,6],[6,1,6,3],[6,4,6,6],[7,1,7,6],[8,1,8,3],[8,4,8,6]]}
[]
[]
[null,"UNIDADE ESCOLAR",null,null,"CÓDIGO INEP"]
[null,{"$f":"Orçamento!$O$4","v":"CENTRO DE ATENDIMENTO EDUCACIONAL ESPECIALIZADO DE IPORÁ"},null,null,{"$f":"Orçamento!$V$4","v":52070069}]
[]
[null,"OBRA",null,null,"CIDADE"]
[null,{"$f":"Orçamento!$O$7","v":"REFORMA"},null,null,{"$f":"Orçamento!$V$7","v":"IPORÁ"}]
[null,null,null,null,null,null,null,"DESONERADA"]
[null,"CRE",null,null,"ÁREA TOTAL CONSTRUÍDA (M²)"]
[null,{"$f":"Orçamento!$O$10","v":"IPORÁ"},null,null,{"$f":"Orçamento!$V$13","v":643.09999999999991}]
[]
["FILTRO","PARCELA DE MAIOR RELEVÂNCIA"]
[{"$f":"IF(G14>0,\"F\",\"\")","v":""},"CÓDIGO","SERVIÇO","DESCRIÇÃO","UNID","QUANT","PARC. MAIOR RELEV (100%)"]
[{"$f":"IF(G14>0,\"F\",\"\")","v":""},{"$f":"Somatório!B22","v":"f."},"INSTALAÇÕES ELÉTRICAS","SUBESTAÇÃO","KVA",{"$f":"SUMIF(Orçamento!$R$20:$R$319,'Parc Maior Relev'!D14,Orçamento!$T$20:$T$319)","v":0},{"$f":"F14","v":0}]
[{"$f":"IF(SUM(G16:G32)>0,\"F\",\"\")","v":"F"},"CÓDIGO","SERVIÇO","DESCRIÇÃO","UNID","QUANT","PARC. MAIOR RELEV (50%)"]
[{"$f":"IF(G16>0,\"F\",\"\")","v":""},{"$f":"Somatório!B21","v":"e."},"ESTRUTURA","CONCRETO","M3",{"$f":"SUMIF(Orçamento!$R$20:$R$319,'Parc Maior Relev'!D16,Orçamento!$T$20:$T$319)","v":0},{"$f":"F16*0.5","v":0}]
[{"$f":"IF(G17>0,\"F\",\"\")","v":""},"f.","INSTALAÇÕES ELÉTRICAS","INSTALAÇÕES ELÉTRICAS","KVA",{"$f":"SUMIF(Orçamento!$R$20:$R$319,'Parc Maior Relev'!D17,Orçamento!$T$20:$T$319)","v":0},{"$f":"F17","v":0}]
[{"$f":"IF(G18>0,\"F\",\"\")","v":""},{"$f":"Somatório!B25","v":"i."},"ALVENARIA E DIVISÓRIAS","ALVENARIA DE TIJOLOS","M2",{"$f":"SUMIF(Orçamento!$R$20:$R$319,'Parc Maior Relev'!D18,Orçamento!$T$20:$T$319)","v":0},{"$f":"F18*0.5","v":0}]
["",{"$f":"Somatório!B29","v":"m."},"ESTRUTURA DE MADEIRA","ESTRUTURA DE MADEIRA","M2",{"$f":"SUMIF(Orçamento!$R$20:$R$319,'Parc Maior Relev'!D19,Orçamento!$T$20:$T$319)","v":0},0]
["",{"$f":"Somatório!B31","v":"o."},"COBERTURAS","COBERTURA CERÂMICA","M2",{"$f":"SUMIF(Orçamento!$R$20:$R$319,'Parc Maior Relev'!D20,Orçamento!$T$20:$T$319)","v":0},0]
["","o.","COBERTURAS","COBERTURA COM TELHA METÁLICA","M2",{"$f":"SUMIF(Orçamento!$R$20:$R$319,'Parc Maior Relev'!D21,Orçamento!$T$20:$T$319)","v":0},0]
["",{"$f":"Somatório!B35","v":"s."},"REVESTIMENTO DE PAREDE","CHAPISCO","M2",{"$f":"SUMIF(Orçamento!$R$20:$R$319,'Parc Maior Relev'!D22,Orçamento!$T$20:$T$319)","v":0},0]
["F","s.","REVESTIMENTO DE PAREDE","REBOCO","M2",{"$f":"34.72+208.46+116.45","v":359.63},{"$f":"F23*0.5","v":179.815}]
["","s.","REVESTIMENTO DE PAREDE","REVESTIMENTO CERÂMICO","M2",{"$f":"SUMIF(Orçamento!$R$20:$R$319,'Parc Maior Relev'!D24,Orçamento!$T$20:$T$319)","v":0},{"$f":"F24*0.5","v":0}]
["",{"$f":"Somatório!B36","v":"t."},"FORROS","FORRO DE GESSO","M2",{"$f":"SUMIF(Orçamento!$R$20:$R$319,'Parc Maior Relev'!D25,Orçamento!$T$20:$T$319)","v":0},{"$f":"F25*0.5","v":0}]
["","t.","FORROS","FORRO DE PVC","M2",{"$f":"SUMIF(Orçamento!$R$20:$R$319,'Parc Maior Relev'!D26,Orçamento!$T$20:$T$319)","v":0},{"$f":"F26*0.5","v":0}]
["","t.","FORROS","FORRO DE GESSO ACARTONADO","M2",{"$f":"SUMIF(Orçamento!$R$20:$R$319,'Parc Maior Relev'!D27,Orçamento!$T$20:$T$319)","v":0},{"$f":"F27*0.5","v":0}]
["","u.","REVESTIMENTO DE PISO","PISO DE GRANITINA","M2",{"$f":"SUMIF(Orçamento!$R$20:$R$319,'Parc Maior Relev'!D28,Orçamento!$T$20:$T$319)","v":0},0]
["","u.","REVESTIMENTO DE PISO","PISO LAMINADO","M2",{"$f":"SUMIF(Orçamento!$R$20:$R$319,'Parc Maior Relev'!D29,Orçamento!$T$20:$T$319)","v":0},0]
["","u.","REVESTIMENTO DE PISO","PISO DE CONCRETO DESEMPENADO","M2",{"$f":"SUMIF(Orçamento!$R$20:$R$319,'Parc Maior Relev'!D30,Orçamento!$T$20:$T$319)","v":0},0]
["","u.","REVESTIMENTO DE PISO","PISO CERÂMICO","M2",{"$f":"SUMIF(Orçamento!$R$20:$R$319,'Parc Maior Relev'!D31,Orçamento!$T$20:$T$319)","v":0},{"$f":"F31*0.5","v":0}]
["F","y.","PINTURA","PINTURA","M2",{"$f":"8.26+40.85+916.8+43.64+390","v":1399.55},699.77499999999998]
["F"]
["F","(*) Para os fins do inciso I dp § 1º do Art. 30 da Lei Federal 8.666/93, são consideradas parcelas de maior relevância técnica as execuções apresentadas"]
["F"]

{"sheet":"Composições","index":7,"n_rows":217,"n_cols":10,"rows_kept":217,"cut":false,"hidden":false,"merged":[[15,0,15,9],[13,0,13,2],[13,3,13,6],[1,0,1,9],[3,7,3,9],[4,7,4,9],[6,7,6,9],[7,7,7,9],[6,0,6,6],[10,8,10,9],[13,8,13,9],[14,0,14,9],[8,0,8,9],[5,0,5,9],[2,0,2,9],[0,0,0,8],[10,0,10,2],[10,3,10,6],[11,0,11,9],[12,0,12,2],[12,3,12,6],[12,7,12,8],[7,0,7,6],[9,0,9,2],[9,3,9,6],[9,7,9,8],[3,0,3,6],[4,0,4,6],[23,8,23,9],[16,5,17,5],[16,6,16,7],[16,8,16,9],[16,0,17,0],[16,1,17,1],[16,2,17,2],[16,3,17,3],[16,4,17,4],[19,1,19,7],[21,1,21,7],[23,0,24,0],[23,1,24,1],[23,2,24,2],[23,3,24,3],[23,4,24,4],[23,5,24,5],[23,6,23,7],[40,1,40,7],[42,0,43,0],[42,1,43,1],[42,2,43,2],[42,3,43,3],[42,4,43,4],[42,5,43,5],[42,6,42,7],[32,8,32,9],[37,1,37,7],[28,1,28,7],[30,1,30,7],[32,0,33,0],[32,1,33,1],[32,2,33,2],[32,3,33,3],[32,4,33,4],[32,5,33,5],[32,6,32,7],[42,8,42,9],[61,8,61,9],[66,1,66,7],[57,1,57,7],[50,1,50,7],[52,0,53,0],[52,1,53,1],[52,2,53,2],[52,3,53,3],[52,4,53,4],[52,5,53,5],[52,6,52,7],[52,8,52,9],[47,1,47,7],[97,8,97,9],[77,1,77,7],[75,1,75,7],[59,1,59,7],[61,0,62,0],[61,1,62,1],[61,2,62,2],[61,3,62,3],[61,4,62,4],[61,5,62,5],[61,6,61,7],[68,1,68,7],[70,0,71,0],[70,1,71,1],[70,2,71,2],[70,3,71,3],[70,4,71,4],[70,5,71,5],[70,6,70,7],[88,4,89,4],[102,1,102,7],[105,1,105,7],[107,0,108,0],[107,1,108,1],[107,2,108,2],[79,5,80,5],[79,6,79,7],[79,8,79,9],[84,1,84,7],[86,1,86,7],[79,0,80,0],[79,1,80,1],[79,2,80,2],[79,3,80,3],[79,4,80,4],[95,1,95,7],[97,0,98,0],[97,1,98,1],[97,2,98,2],[97,3,98,3],[97,4,98,4],[97,5,98,5],[97,6,97,7],[70,8,70,9],[107,3,108,3],[107,4,108,4],[107,5,108,5],[107,6,107,7],[107,8,107,9],[112,1,112,7],[115,1,115,7],[117,0,118,0],[117,1,118,1],[117,2,118,2],[117,3,118,3],[117,4,118,4],[117,5,118,5],[117,6,117,7],[117,8,117,9],[88,5,89,5],[88,6,88,7],[88,8,88,9],[93,1,93,7],[88,0,89,0],[88,1,89,1],[88,2,89,2],[88,3,89,3],[121,1,121,7],[125,1,125,7],[127,0,128,0],[127,1,128,1],[127,2,128,2],[127,3,128,3],[127,4,128,4],[127,5,128,5],[127,6,127,7],[127,8,127,9],[131,1,131,7],[135,1,135,7],[137,0,138,0],[137,1,138,1],[137,2,138,2],[137,3,138,3],[137,4,138,4],[137,5,138,5],[137,6,137,7],[137,8,137,9],[141,1,141,7],[142,1,142,7],[144,0,145,0],[144,1,145,1],[144,2,145,2],[144,3,145,3],[144,4,145,4],[144,5,145,5],[144,6,144,7],[144,8,144,9],[148,1,148,7],[155,1,155,7],[157,0,158,0],[157,1,158,1],[157,2,158,2],[157,3,158,3],[157,4,158,4],[157,5,158,5],[157,6,157,7],[157,8,157,9],[161,1,161,7],[168,1,168,7],[170,0,171,0],[170,1,171,1],[170,2,171,2],[170,3,171,3],[170,4,171,4],[170,5,171,5],[170,6,170,7],[170,8,170,9],[174,1,174,7],[178,1,178,7],[180,0,181,0],[180,1,181,1],[180,2,181,2],[180,3,181,3],[180,4,181,4],[180,5,181,5],[180,6,180,7],[180,8,180,9],[185,1,185,7],[187,1,187,7],[189,0,190,0],[189,1,190,1],[189,2,190,2],[189,3,190,3],[189,4,190,4],[189,5,190,5],[189,6,189,7],[189,8,189,9],[193,1,193,7],[197,1,197,7],[199,0,200,0],[199,1,200,1],[199,2,200,2],[199,3,200,3],[199,4,200,4],[199,5,200,5],[199,6,199,7],[199,8,199,9],[209,8,209,9],[214,1,214,7],[216,1,216,7],[203,1,203,7],[207,1,207,7],[209,0,210,0],[209,1,210,1],[209,2,210,2],[209,3,210,3],[209,4,210,4],[209,5,210,5],[209,6,209,7]]}
[]
[]
[]
["UNIDADE ESCOLAR",null,null,null,null,null,null,"CÓDIGO INEP"]
[{"$f":"Orçamento!$O$4","v":"CENTRO DE ATENDIMENTO EDUCACIONAL ESPECIALIZADO DE IPORÁ"},null,null,null,null,null,null,{"$f":"Orçamento!$V$4","v":52070069}]
[]
["OBRA",null,null,null,null,null,null,"CIDADE"]
[{"$f":"Orçamento!$O$7","v":"REFORMA"},null,null,null,null,null,null,"DESONERADA"]
[]
["CRE",null,null,"ENDEREÇO",null,null,null,"REFERÊNCIA AGETOP"]
[{"$f":"Orçamento!$O$10","v":"IPORÁ"},null,null,{"$f":"Orçamento!$R$10","v":"AV DR NETO ESQ. C/ RUA GOIÂNIA S/N, CENTRO, CEP:76200-000"},null,null,null,{"$f":"Orçamento!$S$10","v":"ABR/19"},{"$f":"Orçamento!$T$10","v":"DESONERADA"}]
[]
["DATA",null,null,"ÁREA TOTAL CONSTRUÍDA (M²)",null,null,null,"REFERÊNCIA SINAPI"]
[{"$f":"Orçamento!$S$7","v":"2020-04-06"},null,null,{"$f":"Orçamento!$V$13","v":643.09999999999991},null,null,null,{"$f":"Orçamento!$V$10","v":"DEZ/19"},{"$f":"Orçamento!$W$10","v":"DESONERADA"}]
[]
["COMPOSIÇÕES DE CUSTOS UNITÁRIOS - SEE-GO"]
[10,"FONTE","CÓDIGO","DESCRIÇÃO","UNIDADE","COEFIC.","CUSTO UNITÁRIO",null,"CUSTO  TOTAL (A) + (B) + (C) + (D) + (E)"]
[null,null,null,null,null,null,"DESONERADO","NÃO DESONER.","DESONERADO","NÃO DESONER."]
[null,"COMPOSIÇÃO","COMP 010_SEE","DEMOLIÇÃO DE GRADE/GRELHA/CORRIMÃO/GUARDA CORPO - METÁLICO","M2",null,"-","-",4.0599999999999996,4.71]
[null,"MÃO DE OBRA (B) - TOTAL",null,null,null,null,null,null,0,0]
[null,"AGETOP",20106,"RETIRADA DE JANELAS OU PORTAIS C/ TRANSP. ATÉ CB. E CARGA","m2    ",1,4.0599999999999996,4.71,4.0599999999999996,4.71]
[null,"MATERIAL (C) - TOTAL",null,null,null,null,null,null,4.0599999999999996,4.71]
[]
[387,"FONTE","CÓDIGO","DESCRIÇÃO","UNIDADE","COEFIC.","CUSTO UNITÁRIO",null,"CUSTO  TOTAL (A) + (B) + (C) + (D) + (E)"]
[null,null,null,null,null,null,"DESONERADO","NÃO DESONER.","DESONERADO","NÃO DESONER."]
[null,"COMPOSIÇÃO","COMP 387_SEE","LÂMPADA LED TUBULAR 18W ","UN ",null,null,null,22.3,22.35]
[null,"AGETOP_I",8,"AJUDANTE","h     ",1.4999999999999999E-2,8.75,10.14,0.13,0.15]
[null,"AGETOP_I",12,"ELETRICISTA","h     ",1.4999999999999999E-2,13.95,16.16,0.21,0.24]
[null,"MÃO DE OBRA (B) - TOTAL",null,null,null,null,null,null,0.33999999999999997,0.39]
[null,"COTAÇÃO","COT 195_SEE","LÂMPADA LED TUBULAR 18W ","UN",1,21.959999999999997,21.959999999999997,21.96,21.96]
[null,"MATERIAL (C) - TOTAL",null,null,null,null,null,null,21.96,21.96]
[]
[382,"FONTE","CÓDIGO","DESCRIÇÃO","UNIDADE","COEFIC.","CUSTO UNITÁRIO",null,"CUSTO  TOTAL (A) + (B) + (C) + (D) + (E)"]
[null,null,null,null,null,null,"DESONERADO","NÃO DESONER.","DESONERADO","NÃO DESONER."]
[null,"COMPOSIÇÃO","COMP 382_SEE","TE DE REDUCAO DE FERRO GALVANIZADO, COM ROSCA BSP, DE 3/4\" X 1/2\"","UN ",null,null,null,23.02,25.2]
[null,"AGETOP_I",8,"AJUDANTE","h     ",0.6,8.75,10.14,5.25,6.08]
[null,"AGETOP_I",11,"ENCANADOR","h     ",0.61050000000000004,13.95,16.16,8.52,9.8699999999999992]
[null,"MÃO DE OBRA (B) - TOTAL",null,null,null,null,null,null,13.77,15.95]
[null,"SINAPI_I",3146,"FITA VEDA ROSCA EM ROLOS DE 18 MM X 10 M (L X C)","UN    ",0.12075471698113208,3.4,3.4,0.41,0.41]
[null,"SINAPI_I",6302,"TE DE REDUCAO DE FERRO GALVANIZADO, COM ROSCA BSP, DE 3/4\" X 1/2\"","UN    ",1,8.84,8.84,8.84,8.84]
[null,"MATERIAL (C) - TOTAL",null,null,null,null,null,null,9.25,9.25]
[]
[383,"FONTE","CÓDIGO","DESCRIÇÃO","UNIDADE","COEFIC.","CUSTO UNITÁRIO",null,"CUSTO  TOTAL (A) + (B) + (C) + (D) + (E)"]
[null,null,null,null,null,null,"DESONERADO","NÃO DESONER.","DESONERADO","NÃO DESONER."]
[null,"COMPOSIÇÃO","COMP 383_SEE","BUCHA DE REDUCAO DE FERRO GALVANIZADO, COM ROSCA BSP, DE 1/2\" X 1/4\"","UN ",null,null,null,7.22,7.8]
[null,"AGETOP_I",8,"AJUDANTE","h     ",0.16,8.75,10.14,1.4,1.62]
[null,"AGETOP_I",11,"ENCANADOR","h     ",0.16,13.95,16.16,2.23,2.59]
[null,"MÃO DE OBRA (B) - TOTAL",null,null,null,null,null,null,3.63,4.21]
[null,"AGETOP_I","H689","FITA VEDAROSCA 12 MM","m",1.2,0.28000000000000003,0.28000000000000003,0.34,0.34]
[null,"SINAPI_I",770,"BUCHA DE REDUCAO DE FERRO GALVANIZADO, COM ROSCA BSP, DE 1/2\" X 1/4\"","UN    ",1,3.25,3.25,3.25,3.25]
[null,"MATERIAL (C) - TOTAL",null,null,null,null,null,null,3.59,3.59]
[]
[212,"FONTE","CÓDIGO","DESCRIÇÃO","UNIDADE","COEFIC.","CUSTO UNITÁRIO",null,"CUSTO  TOTAL (A) + (B) + (C) + (D) + (E)"]
[null,null,null,null,null,null,"DESONERADO","NÃO DESONER.","DESONERADO","NÃO DESONER."]
[null,"COMPOSIÇÃO","COMP 212_SEE","NIPLE DE REDUÇÃO 1/2\" X 1/4\" BSP","UN ",null,null,null,9.68,10.26]
[null,"AGETOP_I",8,"AJUDANTE","h     ",0.16,8.75,10.14,1.4,1.62]
[null,"AGETOP_I",11,"ENCANADOR","h     ",0.16,13.95,16.16,2.23,2.59]
[null,"MÃO DE OBRA (B) - TOTAL",null,null,null,null,null,null,3.63,4.21]
[null,"COTAÇÃO","COT 103_SEE","NIPLE DE REDUÇÃO 1/2\" X 1/4\" BSP","UN",1,6.0533333333333337,6.0533333333333337,6.05,6.05]
[null,"MATERIAL (C) - TOTAL",null,null,null,null,null,null,6.05,6.05]
[]
[213,"FONTE","CÓDIGO","DESCRIÇÃO","UNIDADE","COEFIC.","CUSTO UNITÁRIO",null,"CUSTO  TOTAL (A) + (B) + (C) + (D) + (E)"]
[null,null,null,null,null,null,"DESONERADO","NÃO DESONER.","DESONERADO","NÃO DESONER."]
[null,"COMPOSIÇÃO","COMP 213_SEE","NIPLE DE REDUÇÃO 3/4\" X 1/2\" BSP","UN ",null,null,null,13.34,13.920000000000002]
[null,"AGETOP_I",8,"AJUDANTE","h     ",0.16,8.75,10.14,1.4,1.62]
[null,"AGETOP_I",11,"ENCANADOR","h     ",0.16,13.95,16.16,2.23,2.59]
[null,"MÃO DE OBRA (B) - TOTAL",null,null,null,null,null,null,3.63,4.21]
[null,"COTAÇÃO","COT 104_SEE","NIPLE DE REDUÇÃO 3/4\" X 1/2\" BSP","UN",1,9.7099999999999991,9.7099999999999991,9.7100000000000009,9.7100000000000009]
[null,"MATERIAL (C) - TOTAL",null,null,null,null,null,null,9.7100000000000009,9.7100000000000009]
[]
[237,"FONTE","CÓDIGO","DESCRIÇÃO","UNIDADE","COEFIC.","CUSTO UNITÁRIO",null,"CUSTO  TOTAL (A) + (B) + (C) + (D) + (E)"]
[null,null,null,null,null,null,"DESONERADO","NÃO DESONER.","DESONERADO","NÃO DESONER."]
[null,"COMPOSIÇÃO","COMP 237_SEE","FITA ANTICORROSIVA","M",null,null,null,11.16,11.879999999999999]
[null,"AGETOP_I",8,"AJUDANTE","h     ",0.2,8.75,10.14,1.75,2.0299999999999998]
[null,"AGETOP_I",12,"ELETRICISTA","h     ",0.2,13.95,16.16,2.79,3.23]
[null,"MÃO DE OBRA (B) - TOTAL",null,null,null,null,null,null,4.54,5.26]
[null,"SINAPI_I",39634,"FITA ADESIVA ANTICORROSIVA DE PVC FLEXIVEL, COR PRETA, PARA PROTECAO TUBULACAO, 50 MM X 30 M (L X C), E= *0,25* MM","M     ",1,6.62,6.62,6.62,6.62]
[null,"MATERIAL (C) - TOTAL",null,null,null,null,null,null,6.62,6.62]
[]
[542,"FONTE","CÓDIGO","DESCRIÇÃO","UNIDADE","COEFIC.","CUSTO UNITÁRIO",null,"CUSTO  TOTAL (A) + (B) + (C) + (D) + (E)"]
[null,null,null,null,null,null,"DESONERADO","NÃO DESONER.","DESONERADO","NÃO DESONER."]
[null,"COMPOSIÇÃO","COMP 542_SEE","VÁLVULA UGV 3/4\" (S) LATÃO","UN ",null,null,null,25.65,27.2]
[null,"AGETOP_I",8,"AJUDANTE","h     ",0.432,8.75,10.14,3.78,4.38]
[null,"AGETOP_I",11,"ENCANADOR","h     ",0.432,13.95,16.16,6.03,6.98]
[null,"MÃO DE OBRA (B) - TOTAL",null,null,null,null,null,null,9.81,11.36]
[null,"COTAÇÃO","COT 281_SEE","VÁLVULA UGV 3/4\" (S) LATÃO","UN ",1,15.836666666666666,15.836666666666666,15.84,15.84]
[null,"MATERIAL (C) - TOTAL",null,null,null,null,null,null,15.84,15.84]
[]
[543,"FONTE","CÓDIGO","DESCRIÇÃO","UNIDADE","COEFIC.","CUSTO UNITÁRIO",null,"CUSTO  TOTAL (A) + (B) + (C) + (D) + (E)"]
[null,null,null,null,null,null,"DESONERADO","NÃO DESONER.","DESONERADO","NÃO DESONER."]
[null,"COMPOSIÇÃO","COMP 543_SEE","VÁLVULA UGV 1/2\" (S) LATÃO","UN ",null,null,null,24.98,26.53]
[null,"AGETOP_I",8,"AJUDANTE","h     ",0.432,8.75,10.14,3.78,4.38]
[null,"AGETOP_I",11,"ENCANADOR","h     ",0.432,13.95,16.16,6.03,6.98]
[null,"MÃO DE OBRA (B) - TOTAL",null,null,null,null,null,null,9.81,11.36]
[null,"COTAÇÃO","COT 282_SEE","VÁLVULA UGV 1/2\" (S) LATÃO","UN ",1,15.166666666666666,15.166666666666666,15.17,15.17]
[null,"MATERIAL (C) - TOTAL",null,null,null,null,null,null,15.17,15.17]
[]
[211,"FONTE","CÓDIGO","DESCRIÇÃO","UNIDADE","COEFIC.","CUSTO UNITÁRIO",null,"CUSTO  TOTAL (A) + (B) + (C) + (D) + (E)"]
[null,null,null,null,null,null,"DESONERADO","NÃO DESONER.","DESONERADO","NÃO DESONER."]
[null,"COMPOSIÇÃO","COMP 211_SEE","REGULADOR DE 2º ESTÁGIO 5KG/H","UN ",null,null,null,86.72,90.86]
[null,"AGETOP_I",8,"AJUDANTE","h     ",1.1499999999999999,8.75,10.14,10.06,11.66]
[null,"AGETOP_I",11,"ENCANADOR","h     ",1.1499999999999999,13.95,16.16,16.04,18.579999999999998]
[null,"MÃO DE OBRA (B) - TOTAL",null,null,null,null,null,null,26.1,30.24]
[null,"COTAÇÃO","COT 102_SEE","REGULADOR DE 2º ESTÁGIO 5KG/H","UN",1,59.833333333333336,59.833333333333336,59.83,59.83]
[null,"AGETOP_I","H689","FITA VEDAROSCA 12 MM","m",2.82,0.28000000000000003,0.28000000000000003,0.79,0.79]
[null,"MATERIAL (C) - TOTAL",null,null,null,null,null,null,60.62,60.62]
[]
[210,"FONTE","CÓDIGO","DESCRIÇÃO","UNIDADE","COEFIC.","CUSTO UNITÁRIO",null,"CUSTO  TOTAL (A) + (B) + (C) + (D) + (E)"]
[null,null,null,null,null,null,"DESONERADO","NÃO DESONER.","DESONERADO","NÃO DESONER."]
[null,"COMPOSIÇÃO","COMP 210_SEE","REGULADOR DE 1º ESTÁGIO 60KG/H MODELO AP-40  COM MANÔMETRO","UN ",null,null,null,232.47,236.61]
[null,"AGETOP_I",8,"AJUDANTE","h     ",1.1499999999999999,8.75,10.14,10.06,11.66]
[null,"AGETOP_I",11,"ENCANADOR","h     ",1.1499999999999999,13.95,16.16,16.04,18.579999999999998]
[null,"MÃO DE OBRA (B) - TOTAL",null,null,null,null,null,null,26.1,30.24]
[null,"COTAÇÃO","COT 101_SEE","REGULADOR DE 1º ESTÁGIO 60KG/H MODELO AP-40  COM MANÔMETRO","UN",1,205.57666666666668,205.57666666666668,205.58,205.58]
[null,"AGETOP_I","H689","FITA VEDAROSCA 12 MM","m",2.82,0.28000000000000003,0.28000000000000003,0.79,0.79]
[null,"MATERIAL (C) - TOTAL",null,null,null,null,null,null,206.37,206.37]
[]
[235,"FONTE","CÓDIGO","DESCRIÇÃO","UNIDADE","COEFIC.","CUSTO UNITÁRIO",null,"CUSTO  TOTAL (A) + (B) + (C) + (D) + (E)"]
[null,null,null,null,null,null,"DESONERADO","NÃO DESONER.","DESONERADO","NÃO DESONER."]
[null,"COMPOSIÇÃO","COMP 235_SEE","PLACA DE SINALIZAÇÃO EM PVC COD 01 - (300X300) PROIBIDO FUMAR","UN ",null,null,null,25.319999999999997,25.439999999999998]
[null,"AGETOP_I",5,"SERVENTE","h     ",0.09,8.75,10.14,0.79,0.91]
[null,"MÃO DE OBRA (B) - TOTAL",null,null,null,null,null,null,0.79,0.91]
[null,"AGETOP_I",3070,"BUCHA DE NYLON S-6","un",2,0.04,0.04,0.08,0.08]
[null,"AGETOP_I",3393,"PARAFUSO P/BUCHA S-6","un",2,0.08,0.08,0.16,0.16]
[null,"SINAPI_I",37556,"PLACA DE SINALIZACAO DE SEGURANCA CONTRA INCENDIO, FOTOLUMINESCENTE, QUADRADA, *20 X 20* CM, EM PVC *2* MM ANTI-CHAMAS (SIMBOLOS, CORES E PICTOGRAMAS CONFORME NBR 13434)","UN    ",1,24.29,24.29,24.29,24.29]
[null,"MATERIAL (C) - TOTAL",null,null,null,null,null,null,24.529999999999998,24.529999999999998]
[]
[236,"FONTE","CÓDIGO","DESCRIÇÃO","UNIDADE","COEFIC.","CUSTO UNITÁRIO",null,"CUSTO  TOTAL (A) + (B) + (C) + (D) + (E)"]
[null,null,null,null,null,null,"DESONERADO","NÃO DESONER.","DESONERADO","NÃO DESONER."]
[null,"COMPOSIÇÃO","COMP 236_SEE","PLACA DE SINALIZAÇÃO EM PVC COD 06 - (300X300) PERIGO INFLAMÁVEL","UN ",null,null,null,25.319999999999997,25.439999999999998]
[null,"AGETOP_I",5,"SERVENTE","h     ",0.09,8.75,10.14,0.79,0.91]
[null,"MÃO DE OBRA (B) - TOTAL",null,null,null,null,null,null,0.79,0.91]
[null,"AGETOP_I",3070,"BUCHA DE NYLON S-6","un",2,0.04,0.04,0.08,0.08]
[null,"AGETOP_I",3393,"PARAFUSO P/BUCHA S-6","un",2,0.08,0.08,0.16,0.16]
[null,"SINAPI_I",37556,"PLACA DE SINALIZACAO DE SEGURANCA CONTRA INCENDIO, FOTOLUMINESCENTE, QUADRADA, *20 X 20* CM, EM PVC *2* MM ANTI-CHAMAS (SIMBOLOS, CORES E PICTOGRAMAS CONFORME NBR 13434)","UN    ",1,24.29,24.29,24.29,24.29]
[null,"MATERIAL (C) - TOTAL",null,null,null,null,null,null,24.529999999999998,24.529999999999998]
[]
[45,"FONTE","CÓDIGO","DESCRIÇÃO","UNIDADE","COEFIC.","CUSTO UNITÁRIO",null,"CUSTO  TOTAL (A) + (B) + (C) + (D) + (E)"]
[null,null,null,null,null,null,"DESONERADO","NÃO DESONER.","DESONERADO","NÃO DESONER."]
[null,"COMPOSIÇÃO","COMP 045_SEE","LAUDO DE ESTANQUEIDADE","UN ",null,null,null,936,1085.1199999999999]
[null,"AGETOP",250101,"ENGENHEIRO - (OBRAS CIVIS)","H     ",16,58.5,67.819999999999993,936,1085.1199999999999]
[null,"MÃO DE OBRA (B) - TOTAL",null,null,null,null,null,null,936,1085.1199999999999]
[null,"MATERIAL (C) - TOTAL",null,null,null,null,null,null,0,0]
[]
[277,"FONTE","CÓDIGO","DESCRIÇÃO","UNIDADE","COEFIC.","CUSTO UNITÁRIO",null,"CUSTO  TOTAL (A) + (B) + (C) + (D) + (E)"]
[null,null,null,null,null,null,"DESONERADO","NÃO DESONER.","DESONERADO","NÃO DESONER."]
[null,"COMPOSIÇÃO","COMP 277_SEE","MARCAÇÃO NO PISO - 1X1 M PARA EXTINTOR","M2",null,null,null,29.58,29.650000000000002]
[null,"AGETOP_I",5,"SERVENTE","h     ",3.3300000000000003E-2,8.75,10.14,0.28999999999999998,0.34]
[null,"MÃO DE OBRA (B) - TOTAL",null,null,null,null,null,null,0.28999999999999998,0.34]
[null,"SINAPI_I",5318,"SOLVENTE DILUENTE A BASE DE AGUARRAS","L     ",0.13,11,11,1.43,1.43]
[null,"SINAPI",5824,"CAMINHÃO TOCO, PBT 16.000 KG, CARGA ÚTIL MÁX. 10.685 KG, DIST. ENTRE EIXOS 4,8 M, POTÊNCIA 189 CV, INCLUSIVE CARROCERIA FIXA ABERTA DE MADEIRA P/ TRANSPORTE GERAL DE CARGA SECA, DIMEN. APROX. 2,5 X 7,00 X 0,50 M - CHP DIURNO. AF_06/2014","CHP",3.3E-3,124.46,127.65,0.41,0.42]
[null,"SINAPI_I",7343,"TINTA A BASE DE RESINA ACRILICA, PARA SINALIZACAO HORIZONTAL VIARIA (NBR 11862)","L     ",0.6,12.82,12.82,7.69,7.69]
[null,"SINAPI_I",7348,"TINTA ACRILICA PREMIUM PARA PISO","L     ",0.03,13.33,13.33,0.4,0.4]
[null,"SINAPI_I",25972,"MICROESFERAS DE VIDRO PARA SINALIZACAO HORIZONTAL VIARIA, TIPO I-B (PREMIX) - NBR 16184","KG    ",2.14,8.8800000000000008,8.8800000000000008,19,19]
[null,"SINAPI",95133,"MÁQUINA DEMARCADORA DE FAIXA DE TRÁFEGO À FRIO, AUTOPROPELIDA, POTÊNCIA 38 HP - CHP DIURNO. AF_07/2016","CHP",3.3E-3,108.41,111.96,0.36,0.37]
[null,"MATERIAL (C) - TOTAL",null,null,null,null,null,null,29.29,29.310000000000002]
[]
[277,"FONTE","CÓDIGO","DESCRIÇÃO","UNIDADE","COEFIC.","CUSTO UNITÁRIO",null,"CUSTO  TOTAL (A) + (B) + (C) + (D) + (E)"]
[null,null,null,null,null,null,"DESONERADO","NÃO DESONER.","DESONERADO","NÃO DESONER."]
[null,"COMPOSIÇÃO","COMP 277_SEE","MARCAÇÃO NO PISO - 1X1 M PARA EXTINTOR","M2",null,null,null,29.58,29.650000000000002]
[null,"AGETOP_I",5,"SERVENTE","h     ",3.3300000000000003E-2,8.75,10.14,0.28999999999999998,0.34]
[null,"MÃO DE OBRA (B) - TOTAL",null,null,null,null,null,null,0.28999999999999998,0.34]
[null,"SINAPI_I",5318,"SOLVENTE DILUENTE A BASE DE AGUARRAS","L     ",0.13,11,11,1.43,1.43]
[null,"SINAPI",5824,"CAMINHÃO TOCO, PBT 16.000 KG, CARGA ÚTIL MÁX. 10.685 KG, DIST. ENTRE EIXOS 4,8 M, POTÊNCIA 189 CV, INCLUSIVE CARROCERIA FIXA ABERTA DE MADEIRA P/ TRANSPORTE GERAL DE CARGA SECA, DIMEN. APROX. 2,5 X 7,00 X 0,50 M - CHP DIURNO. AF_06/2014","CHP",3.3E-3,124.46,127.65,0.41,0.42]
[null,"SINAPI_I",7343,"TINTA A BASE DE RESINA ACRILICA, PARA SINALIZACAO HORIZONTAL VIARIA (NBR 11862)","L     ",0.6,12.82,12.82,7.69,7.69]
[null,"SINAPI_I",7348,"TINTA ACRILICA PREMIUM PARA PISO","L     ",0.03,13.33,13.33,0.4,0.4]
[null,"SINAPI_I",25972,"MICROESFERAS DE VIDRO PARA SINALIZACAO HORIZONTAL VIARIA, TIPO I-B (PREMIX) - NBR 16184","KG    ",2.14,8.8800000000000008,8.8800000000000008,19,19]
[null,"SINAPI",95133,"MÁQUINA DEMARCADORA DE FAIXA DE TRÁFEGO À FRIO, AUTOPROPELIDA, POTÊNCIA 38 HP - CHP DIURNO. AF_07/2016","CHP",3.3E-3,108.41,111.96,0.36,0.37]
[null,"MATERIAL (C) - TOTAL",null,null,null,null,null,null,29.29,29.310000000000002]
[]
[24,"FONTE","CÓDIGO","DESCRIÇÃO","UNIDADE","COEFIC.","CUSTO UNITÁRIO",null,"CUSTO  TOTAL (A) + (B) + (C) + (D) + (E)"]
[null,null,null,null,null,null,"DESONERADO","NÃO DESONER.","DESONERADO","NÃO DESONER."]
[null,"COMPOSIÇÃO","COMP 024_SEE","SINALIZADOR FOTOLUMINESCENTE PARA EXTINTOR","UN ",null,"-","-",25.319999999999997,25.439999999999998]
[null,"AGETOP_I",5,"SERVENTE","h     ",0.09,8.75,10.14,0.79,0.91]
[null,"MÃO DE OBRA (B) - TOTAL",null,null,null,null,null,null,0.79,0.91]
[null,"AGETOP_I",3070,"BUCHA DE NYLON S-6","un",2,0.04,0.04,0.08,0.08]
[null,"AGETOP_I",3393,"PARAFUSO P/BUCHA S-6","un",2,0.08,0.08,0.16,0.16]
[null,"SINAPI_I",37556,"PLACA DE SINALIZACAO DE SEGURANCA CONTRA INCENDIO, FOTOLUMINESCENTE, QUADRADA, *20 X 20* CM, EM PVC *2* MM ANTI-CHAMAS (SIMBOLOS, CORES E PICTOGRAMAS CONFORME NBR 13434)","UN    ",1,24.29,24.29,24.29,24.29]
[null,"MATERIAL (C) - TOTAL",null,null,null,null,null,null,24.529999999999998,24.529999999999998]
[]
[33,"FONTE","CÓDIGO","DESCRIÇÃO","UNIDADE","COEFIC.","CUSTO UNITÁRIO",null,"CUSTO  TOTAL (A) + (B) + (C) + (D) + (E)"]
[null,null,null,null,null,null,"DESONERADO","NÃO DESONER.","DESONERADO","NÃO DESONER."]
[null,"COMPOSIÇÃO","COMP 033_SEE","LUMINÁRIA DE EMERGÊNCIA LED PORTÁTIL - 30 LEDS","UN ",null,null,null,86.53,88.69]
[null,"AGETOP_I",8,"AJUDANTE","h     ",0.6,8.75,10.14,5.25,6.08]
[null,"AGETOP_I",12,"ELETRICISTA","h     ",0.6,13.95,16.16,8.3699999999999992,9.6999999999999993]
[null,"MÃO DE OBRA (B) - TOTAL",null,null,null,null,null,null,13.62,15.78]
[null,"SINAPI_I",38774,"LUMINARIA DE EMERGENCIA 30 LEDS, POTENCIA 2 W, BATERIA DE LITIO, AUTONOMIA DE 6 HORAS","UN    ",1,72.91,72.91,72.91,72.91]
[null,"MATERIAL (C) - TOTAL",null,null,null,null,null,null,72.91,72.91]
[]
[411,"FONTE","CÓDIGO","DESCRIÇÃO","UNIDADE","COEFIC.","CUSTO UNITÁRIO",null,"CUSTO  TOTAL (A) + (B) + (C) + (D) + (E)"]
[null,null,null,null,null,null,"DESONERADO","NÃO DESONER.","DESONERADO","NÃO DESONER."]
[null,"COMPOSIÇÃO","COMP 411_SEE","PLACA DE SINALIZAÇÃO EM PVC COD 13 - (316X158) SAÍDA DE EMERGÊNCIA","UN ",null,null,null,30.819999999999997,30.939999999999998]
[null,"AGETOP_I",5,"SERVENTE","h     ",0.09,8.75,10.14,0.79,0.91]
[null,"MÃO DE OBRA (B) - TOTAL",null,null,null,null,null,null,0.79,0.91]
[null,"AGETOP_I",3070,"BUCHA DE NYLON S-6","un",2,0.04,0.04,0.08,0.08]
[null,"AGETOP_I",3393,"PARAFUSO P/BUCHA S-6","un",2,0.08,0.08,0.16,0.16]
[null,"SINAPI_I",37559,"PLACA DE SINALIZACAO DE SEGURANCA CONTRA INCENDIO, FOTOLUMINESCENTE, RETANGULAR, *12 X 40* CM, EM PVC *2* MM ANTI-CHAMAS (SIMBOLOS, CORES E PICTOGRAMAS CONFORME NBR 13434)","UN    ",1,29.79,29.79,29.79,29.79]
[null,"MATERIAL (C) - TOTAL",null,null,null,null,null,null,30.029999999999998,30.029999999999998]
[]
[412,"FONTE","CÓDIGO","DESCRIÇÃO","UNIDADE","COEFIC.","CUSTO UNITÁRIO",null,"CUSTO  TOTAL (A) + (B) + (C) + (D) + (E)"]
[null,null,null,null,null,null,"DESONERADO","NÃO DESONER.","DESONERADO","NÃO DESONER."]
[null,"COMPOSIÇÃO","COMP 412_SEE","PLACA DE SINALIZAÇÃO EM PVC COD 17 - (316X158) MENSAGEM \"SAÍDA\"","UN ",null,null,null,30.819999999999997,30.939999999999998]
[null,"AGETOP_I",5,"SERVENTE","h     ",0.09,8.75,10.14,0.79,0.91]
[null,"MÃO DE OBRA (B) - TOTAL",null,null,null,null,null,null,0.79,0.91]
[null,"AGETOP_I",3070,"BUCHA DE NYLON S-6","un",2,0.04,0.04,0.08,0.08]
[null,"AGETOP_I",3393,"PARAFUSO P/BUCHA S-6","un",2,0.08,0.08,0.16,0.16]
[null,"SINAPI_I",37559,"PLACA DE SINALIZACAO DE SEGURANCA CONTRA INCENDIO, FOTOLUMINESCENTE, RETANGULAR, *12 X 40* CM, EM PVC *2* MM ANTI-CHAMAS (SIMBOLOS, CORES E PICTOGRAMAS CONFORME NBR 13434)","UN    ",1,29.79,29.79,29.79,29.79]
[null,"MATERIAL (C) - TOTAL",null,null,null,null,null,null,30.029999999999998,30.029999999999998]
[]
[338,"FONTE","CÓDIGO","DESCRIÇÃO","UNIDADE","COEFIC.","CUSTO UNITÁRIO",null,"CUSTO  TOTAL (A) + (B) + (C) + (D) + (E)"]
[null,null,null,null,null,null,"DESONERADO","NÃO DESONER.","DESONERADO","NÃO DESONER."]
[null,"COMPOSIÇÃO","COMP 338_SEE","TELHA GALVALUME AÇO 0,43 COM ISOPOR DE 30 MM ACABAMENTO EM TELHA PREPINTADA NA COR BRANCA OU ACABAMENTO AÇO LIZO PRE PINTADO BRANCO ","M2",null,null,null,97.28,97.86]
[null,"AGETOP_I",15,"MONTADOR DE ESTRUT. METALICA","h     ",0.16020000000000001,13.95,16.16,2.23,2.59]
[null,"AGETOP_I",8,"AJUDANTE","h     ",0.16020000000000001,8.75,10.14,1.4,1.62]
[null,"MÃO DE OBRA (B) - TOTAL",null,null,null,null,null,null,3.63,4.21]
[null,"COTAÇÃO","COT 155_SEE","TELHA GALVALUME AÇO 0,43 COM ISOPOR DE 30MM ACABAMENTO EM TELHA PINTADA NA COR BRANCA OU ACABAMENTO LISO PRE PINTADO","m2",1.1759999999999999,79.63333333333334,79.63333333333334,93.65,93.65]
[null,"MATERIAL (C) - TOTAL",null,null,null,null,null,null,93.65,93.65]